program: Orca
programVersion: 4.2.1
elementType: Br O O N N C C C C C C C C C H H H H H H H H H H H H H
charge: 0
multiplicity: 1
keywords: wb97x-d3
keywords: def2-TZVPP
keywords: def2/J RIJCOSX GRIDX6 NOFINALGRIDX
keywords: grid4 nofinalgrid
keywords: scfconv7
keywords: smallprint printgap noloewdin
keywords: NOSOSCF
formula: C9H13BrN2O2
InChI: InChI=1/C9H13BrN2O2/c1-4-5(2)12-8(13)7(10)6(3)11-9(12)14/h5,11H,4H2,1-3H3
27 atoms
Br 2.775175 0.541206 0.143003
O  0.042282 1.831309 0.202903
O  -2.552028 -1.916441 -0.065332
N  -1.30613 -0.003955 0.064881
N  -0.315298 -2.102804 -0.052035
C  -2.513063 0.85655 0.101576
C  -3.322038 0.768035 -1.194274
C  -3.325884 0.634661 1.369498
C  -0.055658 0.623587 0.121817
C  -1.470942 -1.365577 -0.019974
C  -4.288602 1.9347 -1.343284
C  0.946021 -1.601836 -0.008756
C  1.089438 -0.261259 0.076594
C  2.060914 -2.586216 -0.059008
H  -2.112557 1.866201 0.153248
H  -3.875174 -0.16974 -1.245019
H  -2.629224 0.774707 -2.040124
H  -2.691207 0.697771 2.254553
H  -4.07692 1.41954 1.462741
H  -3.842743 -0.322896 1.382061
H  -5.054112 1.940056 -0.566242
H  -3.770201 2.894983 -1.30655
H  -4.806847 1.879436 -2.301381
H  -0.444179 -3.103511 -0.114914
H  2.700057 -2.403694 -0.922762
H  1.69018 -3.607404 -0.125237
H  2.683602 -2.511898 0.832338
elementType: Br O N C H
totalener: -3185.08789341 hartree
nucrepener: 1275.44640391 hartree
electener: -4460.53429731 hartree
oneelecener: -6948.77217542 hartree
twoeener: 2488.23787810 hartree
cpcmener: -0.02616720 hartree
kineticenergy: 3178.80106352 hartree
xcener: -128.501883178081 hartree
chargesum: -0.0000000
charge: -0.012507 -0.457878 -0.482753 -0.101538 -0.110234 0.092489 -0.101218 -0.291321 0.330588 0.374453 -0.281770 0.188063 -0.240705 -0.198675 0.081592 0.075949 0.078257 0.099424 0.100592 0.098760 0.080789 0.084016 0.093969 0.181940 0.114441 0.089390 0.113885
qa: -0.0125 -0.4579 -0.4828 -0.1015 -0.1102 0.0925 -0.1012 -0.2913 0.3306 0.3745 -0.2818 0.1881 -0.2407 -0.1987 0.0816 0.0759 0.0783 0.0994 0.1006 0.0988 0.0808 0.0840 0.0940 0.1819 0.1144 0.0894 0.1139
va: 1.2594 2.0765 2.0309 3.2041 3.3185 3.7431 3.8544 3.9238 4.2246 4.3500 3.9490 3.7661 3.8912 3.9373 1.0484 1.0250 1.0094 1.0056 1.0010 1.0150 1.0003 1.0004 1.0027 1.0142 0.9988 1.0130 0.9988
dispcorr: -0.011951282 hartree
energy: -3185.099844689262
dipole: -50.44113 51.05936 0.61823 -5.64151 3.47169 -2.16982 -3.70349 3.53066 -0.17282
magnitude: 2.26279 au
magnitude: 5.75154 debye
