program: Orca
programVersion: 4.2.1
elementType: Br O O N N C C C C C C C C C H H H H H H H H H H H H H
charge: 0
multiplicity: 1
keywords: wb97x-d3
keywords: def2-TZVPP
keywords: def2/J RIJCOSX GRIDX6 NOFINALGRIDX
keywords: grid4 nofinalgrid
keywords: scfconv7
keywords: smallprint printgap noloewdin
keywords: NOSOSCF
formula: C9H13BrN2O2
InChI: InChI=1/C9H13BrN2O2/c1-4-5(2)12-8(13)7(10)6(3)11-9(12)14/h5,11H,4H2,1-3H3
27 atoms
Br 2.576909 0.715607 0.113864
O  -0.211593 1.75634 -0.235844
O  -2.521975 -2.176634 -0.343546
N  -1.416083 -0.16844 -0.297366
N  -0.293399 -2.1903 -0.087322
C  -2.690187 0.570799 -0.465688
C  -3.039655 1.427388 0.749631
C  -2.74764 1.335187 -1.780056
C  -0.224178 0.544554 -0.191263
C  -1.487542 -1.545866 -0.25069
C  -3.015465 0.66315 2.064893
C  0.930382 -1.599578 0.027401
C  0.981698 -0.25244 -0.024252
C  2.061087 -2.548739 0.199158
H  -3.445428 -0.20918 -0.523497
H  -4.051718 1.799917 0.572922
H  -2.397715 2.306167 0.810307
H  -2.484742 0.692587 -2.622007
H  -3.772383 1.673175 -1.939651
H  -2.102994 2.211217 -1.79782
H  -2.011516 0.326353 2.330627
H  -3.364701 1.294841 2.882348
H  -3.662764 -0.215989 2.031053
H  -0.348041 -3.199239 -0.047794
H  2.108092 -3.228997 -0.652581
H  1.904399 -3.153058 1.093985
H  3.020918 -2.053114 0.289753
elementType: Br O N C H
totalener: -3185.08820978 hartree
nucrepener: 1295.13850933 hartree
electener: -4480.22671911 hartree
oneelecener: -6988.25819456 hartree
twoeener: 2508.03147545 hartree
cpcmener: -0.02573860 hartree
kineticenergy: 3178.80220581 hartree
xcener: -128.502414987961 hartree
chargesum: -0.0000000
charge: -0.013925 -0.444549 -0.484919 -0.089715 -0.124799 0.072685 -0.108908 -0.290690 0.303663 0.373892 -0.289165 0.164309 -0.193249 -0.219294 0.094641 0.081442 0.079903 0.098966 0.101158 0.097076 0.079641 0.101466 0.087345 0.183419 0.123293 0.122889 0.093423
qa: -0.0139 -0.4445 -0.4849 -0.0897 -0.1248 0.0727 -0.1089 -0.2907 0.3037 0.3739 -0.2892 0.1643 -0.1932 -0.2193 0.0946 0.0814 0.0799 0.0990 0.1012 0.0971 0.0796 0.1015 0.0873 0.1834 0.1233 0.1229 0.0934
va: 1.2510 2.0732 2.0328 3.1681 3.3102 3.7600 3.8148 3.9253 4.2276 4.3413 3.9464 3.7995 3.8544 3.9193 1.0350 1.0084 1.0238 1.0051 1.0019 1.0162 1.0028 1.0047 1.0042 1.0115 0.9968 0.9969 1.0196
dispcorr: -0.012589100 hartree
energy: -3185.100798883470
dipole: -43.38514 44.10654 0.72140 -8.29643 6.24531 -2.05112 1.20015 -1.01194 0.18821
magnitude: 2.18242 au
magnitude: 5.54727 debye
