program: Orca
programVersion: 4.2.1
elementType: Br O O N N C C C C C C C C C H H H H H H H H H H H H H
charge: 0
multiplicity: 1
keywords: wb97x-d3
keywords: def2-TZVPP
keywords: def2/J RIJCOSX GRIDX6 NOFINALGRIDX
keywords: grid4 nofinalgrid
keywords: scfconv7
keywords: smallprint printgap noloewdin
keywords: NOSOSCF
formula: C9H13BrN2O2
InChI: InChI=1/C9H13BrN2O2/c1-4-5(2)12-8(13)7(10)6(3)11-9(12)14/h5,11H,4H2,1-3H3
27 atoms
Br 2.577624 0.680559 0.122891
O  -0.225566 1.765858 -0.22165
O  -2.537279 -2.167104 -0.341296
N  -1.428975 -0.160949 -0.294126
N  -0.308079 -2.186189 -0.084035
C  -2.701164 0.580822 -0.468225
C  -3.056573 1.436821 0.746468
C  -2.746522 1.349073 -1.781064
C  -0.236603 0.553293 -0.182284
C  -1.502193 -1.537067 -0.247727
C  -3.010093 0.682276 2.065736
C  0.91061 -1.594161 0.028565
C  0.962166 -0.245983 -0.019115
C  2.08157 -2.497444 0.194824
H  -3.456477 -0.198672 -0.532685
H  -4.075315 1.794679 0.574413
H  -2.427153 2.325064 0.798183
H  -2.116728 2.235657 -1.781389
H  -2.454119 0.715465 -2.619572
H  -3.773256 1.669915 -1.962312
H  -1.996955 0.376149 2.332169
H  -3.375269 1.3101 2.879384
H  -3.632059 -0.214742 2.041081
H  -0.366718 -3.194577 -0.048801
H  2.610021 -2.280924 1.122977
H  2.789282 -2.368544 -0.624038
H  1.780226 -3.543162 0.216393
elementType: Br O N C H
totalener: -3185.08847029 hartree
nucrepener: 1296.37968169 hartree
electener: -4481.46815198 hartree
oneelecener: -6990.71880093 hartree
twoeener: 2509.25064895 hartree
cpcmener: -0.02589907 hartree
kineticenergy: 3178.80643023 hartree
xcener: -128.503179120923 hartree
chargesum: 0.0000000
charge: -0.011724 -0.447622 -0.484874 -0.087934 -0.110425 0.072215 -0.108906 -0.291657 0.297442 0.379444 -0.290089 0.184225 -0.225512 -0.198478 0.095001 0.082357 0.079277 0.096803 0.099003 0.102151 0.080070 0.101610 0.087381 0.182599 0.113177 0.114788 0.089677
qa: -0.0117 -0.4476 -0.4849 -0.0879 -0.1104 0.0722 -0.1089 -0.2917 0.2974 0.3794 -0.2901 0.1842 -0.2255 -0.1985 0.0950 0.0824 0.0793 0.0968 0.0990 0.1022 0.0801 0.1016 0.0874 0.1826 0.1132 0.1148 0.0897
va: 1.2624 2.0730 2.0321 3.1677 3.3125 3.7611 3.8139 3.9250 4.2273 4.3339 3.9474 3.7810 3.9124 3.9375 1.0346 1.0080 1.0237 1.0160 1.0053 1.0017 1.0023 1.0047 1.0047 1.0135 0.9992 0.9985 1.0131
dispcorr: -0.012703000 hartree
energy: -3185.101173290419
dipole: -43.26849 44.02755 0.75906 -7.60859 5.56139 -2.04720 1.07385 -0.89903 0.17482
magnitude: 2.19038 au
magnitude: 5.56750 debye
