program: Orca
programVersion: 4.2.1
elementType: Br O O N N C C C C C C C C C H H H H H H H H H H H H H
charge: 0
multiplicity: 1
keywords: wb97x-d3
keywords: def2-TZVPP
keywords: def2/J RIJCOSX GRIDX6 NOFINALGRIDX
keywords: grid4 nofinalgrid
keywords: scfconv7
keywords: smallprint printgap noloewdin
keywords: NOSOSCF
formula: C9H13BrN2O2
InChI: InChI=1/C9H13BrN2O2/c1-4-5(2)12-8(13)7(10)6(3)11-9(12)14/h5,11H,4H2,1-3H3
27 atoms
Br 2.668426 0.656707 0.028178
O  -0.056133 1.840223 0.4142
O  -2.608582 -1.929617 0.094266
N  -1.385542 -0.004099 0.261445
N  -0.378352 -2.063584 -0.102718
C  -2.598724 0.8275 0.454263
C  -3.497362 0.840047 -0.780879
C  -3.330908 0.489607 1.744173
C  -0.143635 0.640454 0.253086
C  -1.536554 -1.3589 0.088023
C  -2.778198 1.264311 -2.051898
C  0.87956 -1.545262 -0.134529
C  1.012617 -0.212275 0.039543
C  1.955856 -2.545587 -0.358582
H  -2.21021 1.836177 0.569155
H  -4.299378 1.552711 -0.568261
H  -3.983511 -0.125714 -0.924982
H  -2.651979 0.513997 2.5978
H  -4.098056 1.245509 1.920184
H  -3.822328 -0.480798 1.721287
H  -2.302603 2.240634 -1.93844
H  -2.005086 0.55299 -2.349002
H  -3.478273 1.337119 -2.885317
H  -0.500281 -3.059466 -0.230257
H  1.953853 -3.279356 0.449401
H  2.944351 -2.102549 -0.409878
H  1.776038 -3.083619 -1.290853
elementType: Br O N C H
totalener: -3185.08850305 hartree
nucrepener: 1291.38264196 hartree
electener: -4476.47114502 hartree
oneelecener: -6980.72808683 hartree
twoeener: 2504.25694182 hartree
cpcmener: -0.02585096 hartree
kineticenergy: 3178.80037580 hartree
xcener: -128.502057349779 hartree
chargesum: -0.0000000
charge: -0.012968 -0.448390 -0.482926 -0.104546 -0.122591 0.083161 -0.111698 -0.291091 0.321743 0.364564 -0.282193 0.171203 -0.201876 -0.220439 0.092618 0.079672 0.079567 0.100078 0.100158 0.097068 0.086756 0.077027 0.101116 0.183127 0.124937 0.094228 0.121694
qa: -0.0130 -0.4484 -0.4829 -0.1045 -0.1226 0.0832 -0.1117 -0.2911 0.3217 0.3646 -0.2822 0.1712 -0.2019 -0.2204 0.0926 0.0797 0.0796 0.1001 0.1002 0.0971 0.0868 0.0770 0.1011 0.1831 0.1249 0.0942 0.1217
va: 1.2509 2.0782 2.0314 3.1790 3.3140 3.7494 3.8259 3.9276 4.2217 4.3593 3.9428 3.7872 3.8310 3.9190 1.0419 1.0091 1.0240 1.0040 1.0023 1.0162 1.0042 1.0043 1.0044 1.0121 0.9960 1.0196 0.9975
dispcorr: -0.012541162 hartree
energy: -3185.101044214614
dipole: -46.12863 46.70767 0.57903 -8.78608 6.67895 -2.10714 -3.38906 3.02426 -0.36480
magnitude: 2.21549 au
magnitude: 5.63132 debye
