program: Orca
programVersion: 4.2.1
elementType: Br O O N N C C C C C C C C C H H H H H H H H H H H H H
charge: 0
multiplicity: 1
keywords: wb97x-d3
keywords: def2-TZVPP
keywords: def2/J RIJCOSX GRIDX6 NOFINALGRIDX
keywords: grid4 nofinalgrid
keywords: scfconv7
keywords: smallprint printgap noloewdin
keywords: NOSOSCF
formula: C9H13BrN2O2
InChI: InChI=1/C9H13BrN2O2/c1-4-5(2)12-8(13)7(10)6(3)11-9(12)14/h5,11H,4H2,1-3H3
27 atoms
Br 2.672797 0.625326 0.021722
O  -0.061471 1.852661 0.416288
O  -2.617003 -1.918959 0.096812
N  -1.392262 0.00575 0.26541
N  -0.386668 -2.057841 -0.097157
C  -2.605182 0.837741 0.457796
C  -3.501723 0.853493 -0.778769
C  -3.339569 0.498682 1.746199
C  -0.148895 0.652426 0.256027
C  -1.544887 -1.348386 0.092051
C  -2.780405 1.281885 -2.047187
C  0.866104 -1.537145 -0.128243
C  0.999255 -0.203373 0.043647
C  1.983463 -2.494107 -0.351122
H  -2.216152 1.845997 0.574552
H  -4.304525 1.565107 -0.565492
H  -3.987175 -0.112106 -0.926536
H  -3.832572 -0.470894 1.721306
H  -2.661803 0.520779 2.600826
H  -4.105804 1.255516 1.922349
H  -2.304912 2.257784 -1.929674
H  -2.006828 0.571501 -2.345343
H  -3.479083 1.357531 -2.88153
H  -0.510996 -3.053279 -0.223565
H  1.62004 -3.514612 -0.457327
H  2.684977 -2.472539 0.482693
H  2.538202 -2.239732 -1.254278
elementType: Br O N C H
totalener: -3185.08880833 hartree
nucrepener: 1292.25694010 hartree
electener: -4477.34574842 hartree
oneelecener: -6982.45352964 hartree
twoeener: 2505.10778122 hartree
cpcmener: -0.02601120 hartree
kineticenergy: 3178.80202552 hartree
xcener: -128.502187544040 hartree
chargesum: 0.0000000
charge: -0.011395 -0.451082 -0.482150 -0.104338 -0.108750 0.083547 -0.111474 -0.291278 0.315352 0.370545 -0.282212 0.189416 -0.231710 -0.198803 0.092182 0.079628 0.079526 0.097142 0.100167 0.100127 0.086666 0.077052 0.101068 0.182373 0.089747 0.114085 0.114570
qa: -0.0114 -0.4511 -0.4822 -0.1043 -0.1088 0.0835 -0.1115 -0.2913 0.3154 0.3705 -0.2822 0.1894 -0.2317 -0.1988 0.0922 0.0796 0.0795 0.0971 0.1002 0.1001 0.0867 0.0771 0.1011 0.1824 0.0897 0.1141 0.1146
va: 1.2609 2.0780 2.0314 3.1783 3.3163 3.7487 3.8261 3.9274 4.2266 4.3512 3.9428 3.7690 3.8833 3.9374 1.0422 1.0091 1.0240 1.0161 1.0040 1.0023 1.0044 1.0042 1.0044 1.0140 1.0129 0.9989 0.9987
dispcorr: -0.012636099 hartree
energy: -3185.101444424557
dipole: -46.06118 46.67184 0.61066 -8.15497 6.05006 -2.10490 -3.27760 2.91112 -0.36648
magnitude: 2.22212 au
magnitude: 5.64819 debye
