program: Orca
programVersion: 4.2.1
elementType: Br O O N N C C C C C C C C C H H H H H H H H H H H H H
charge: 0
multiplicity: 1
keywords: wb97x-d3
keywords: def2-TZVPP
keywords: def2/J RIJCOSX GRIDX6 NOFINALGRIDX
keywords: grid4 nofinalgrid
keywords: scfconv7
keywords: smallprint printgap noloewdin
keywords: NOSOSCF
formula: C9H13BrN2O2
InChI: InChI=1/C9H13BrN2O2/c1-4-5(2)12-8(13)7(10)6(3)11-9(12)14/h5,11H,4H2,1-3H3
27 atoms
Br 2.786362 0.511318 -0.002318
O  0.060703 1.821748 0.054795
O  -2.561642 -1.922091 0.01754
N  -1.304166 -0.007627 0.068972
N  -0.325951 -2.116881 0.007509
C  -2.499184 0.86549 0.110098
C  -3.284328 0.8019 -1.200897
C  -3.338736 0.628133 1.35962
C  -0.046223 0.620375 0.046688
C  -1.4872 -1.370541 0.02936
C  -4.322392 1.91166 -1.303753
C  0.942783 -1.618994 -0.000281
C  1.098863 -0.281613 0.017204
C  2.056988 -2.611459 -0.036794
H  -2.083518 1.868215 0.186596
H  -3.769314 -0.168064 -1.310493
H  -2.577404 0.901647 -2.028894
H  -3.90282 -0.300048 1.319187
H  -2.710598 0.617127 2.25076
H  -4.044708 1.449476 1.480024
H  -5.110775 1.80759 -0.558224
H  -3.8702 2.896836 -1.176327
H  -4.802466 1.896624 -2.281873
H  -0.473583 -3.113047 -0.015834
H  2.640624 -2.499899 -0.950101
H  1.689382 -3.635725 0.006726
H  2.736371 -2.460729 0.800708
totalener: -3185.06642835 hartree
nucrepener: 1275.14098018 hartree
electener: -4460.20740853 hartree
oneelecener: -6948.03412996 hartree
twoeener: 2487.82672143 hartree
kineticenergy: 3178.83654318 hartree
xcener: -128.501289931075 hartree
chargesum: 0.0000000
charge: 0.015912 -0.363508 -0.399037 -0.126143 -0.146323 0.088535 -0.113142 -0.286433 0.300179 0.347460 -0.270899 0.167912 -0.241254 -0.220801 0.093414 0.086418 0.071793 0.110559 0.089225 0.091616 0.079008 0.082305 0.088434 0.151312 0.118007 0.069650 0.115802
qa: 0.0159 -0.3635 -0.3990 -0.1261 -0.1463 0.0885 -0.1131 -0.2864 0.3002 0.3475 -0.2709 0.1679 -0.2413 -0.2208 0.0934 0.0864 0.0718 0.1106 0.0892 0.0916 0.0790 0.0823 0.0884 0.1513 0.1180 0.0696 0.1158
va: 1.2901 2.1603 2.1097 3.1964 3.2641 3.7666 3.8656 3.9143 4.2080 4.3476 3.9501 3.7326 3.9472 3.9647 1.0460 1.0235 1.0101 1.0125 1.0096 1.0021 1.0012 1.0012 1.0056 1.0364 0.9983 1.0141 1.0003
dispcorr: -0.011951335 hartree
energy: -3185.078379688102
dipole: -50.60134 51.01626 0.41492 -5.41063 3.94136 -1.46927 -1.97816 1.93244 -0.04572
magnitude: 1.52741 au
magnitude: 3.88238 debye
