program: Orca
programVersion: 4.2.1
elementType: Br O O N N C C C C C C C C C H H H H H H H H H H H H H
charge: 0
multiplicity: 1
keywords: wb97x-d3
keywords: def2-TZVPP
keywords: def2/J RIJCOSX GRIDX6 NOFINALGRIDX
keywords: grid4 nofinalgrid
keywords: scfconv7
keywords: smallprint printgap noloewdin
keywords: NOSOSCF
formula: C9H13BrN2O2
InChI: InChI=1/C9H13BrN2O2/c1-4-5(2)12-8(13)7(10)6(3)11-9(12)14/h5,11H,4H2,1-3H3
27 atoms
Br 2.575049 0.67719 0.135075
O  -0.226746 1.763629 -0.216431
O  -2.539405 -2.17484 -0.349529
N  -1.434615 -0.162312 -0.297233
N  -0.310829 -2.189596 -0.089047
C  -2.706111 0.577592 -0.467742
C  -3.053322 1.439944 0.74545
C  -2.750903 1.346393 -1.781512
C  -0.241069 0.557768 -0.18131
C  -1.515895 -1.540613 -0.253813
C  -3.008905 0.68445 2.065265
C  0.909853 -1.592863 0.029333
C  0.964076 -0.248662 -0.014251
C  2.08757 -2.494351 0.197147
H  -3.459168 -0.205687 -0.526282
H  -4.069987 1.805645 0.574841
H  -2.415033 2.321459 0.790924
H  -2.092096 2.210545 -1.786196
H  -2.489151 0.7018 -2.620999
H  -3.770024 1.697504 -1.947998
H  -1.993968 0.385304 2.329355
H  -3.377355 1.30909 2.878708
H  -3.62353 -0.216575 2.034926
H  -0.381134 -3.193934 -0.057845
H  2.610717 -2.276797 1.127646
H  2.800259 -2.35202 -0.614564
H  1.796123 -3.543849 0.210848
totalener: -3185.06698655 hartree
nucrepener: 1296.16673991 hartree
electener: -4481.23372647 hartree
oneelecener: -6990.09943069 hartree
twoeener: 2508.86570422 hartree
kineticenergy: 3178.83831562 hartree
xcener: -128.502000514535 hartree
chargesum: -0.0000000
charge: 0.016111 -0.369014 -0.388541 -0.104930 -0.146134 0.056977 -0.110154 -0.275510 0.279904 0.344085 -0.275558 0.162628 -0.227464 -0.219880 0.097613 0.071676 0.090591 0.108983 0.088083 0.088332 0.073965 0.094175 0.089104 0.151801 0.116455 0.117279 0.069422
qa: 0.0161 -0.3690 -0.3885 -0.1049 -0.1461 0.0570 -0.1102 -0.2755 0.2799 0.3441 -0.2756 0.1626 -0.2275 -0.2199 0.0976 0.0717 0.0906 0.1090 0.0881 0.0883 0.0740 0.0942 0.0891 0.1518 0.1165 0.1173 0.0694
va: 1.2931 2.1387 2.1274 3.1529 3.2591 3.8061 3.8188 3.9245 4.2032 4.3435 3.9479 3.7505 3.9568 3.9639 1.0332 1.0086 1.0222 1.0147 1.0081 1.0043 1.0044 1.0076 1.0053 1.0357 0.9995 0.9989 1.0143
dispcorr: -0.012682079 hartree
energy: -3185.079668634179
dipole: -43.21030 43.76776 0.55746 -7.55726 6.20786 -1.34940 0.94901 -0.81336 0.13565
magnitude: 1.46630 au
magnitude: 3.72704 debye
