program: Orca
programVersion: 4.2.1
elementType: Br O O N N C C C C C C C C C H H H H H H H H H H H H H
charge: 0
multiplicity: 1
keywords: wb97x-d3
keywords: def2-TZVPP
keywords: def2/J RIJCOSX GRIDX6 NOFINALGRIDX
keywords: grid4 nofinalgrid
keywords: scfconv7
keywords: smallprint printgap noloewdin
keywords: NOSOSCF
formula: C9H13BrN2O2
InChI: InChI=1/C9H13BrN2O2/c1-4-5(2)12-8(13)7(10)6(3)11-9(12)14/h5,11H,4H2,1-3H3
27 atoms
Br 2.679512 0.62225 0.058191
O  -0.053533 1.854767 0.439376
O  -2.624107 -1.905226 0.04974
N  -1.393659 0.01518 0.257255
N  -0.390609 -2.049979 -0.116024
C  -2.599965 0.848537 0.459546
C  -3.511723 0.873026 -0.766552
C  -3.33453 0.492676 1.74522
C  -0.146502 0.664702 0.26689
C  -1.55836 -1.336924 0.066189
C  -2.792898 1.242593 -2.055767
C  0.868758 -1.528718 -0.127075
C  1.007041 -0.201973 0.057151
C  1.992964 -2.485729 -0.3457
H  -2.200801 1.853152 0.581052
H  -4.2808 1.621937 -0.557268
H  -4.035069 -0.076143 -0.879327
H  -3.84202 -0.466912 1.686637
H  -2.651617 0.478017 2.595044
H  -4.084803 1.258389 1.945394
H  -2.248329 2.182679 -1.956331
H  -2.076272 0.477892 -2.358007
H  -3.503022 1.355125 -2.87478
H  -0.524919 -3.039101 -0.251244
H  1.638137 -3.509709 -0.455395
H  2.691059 -2.457461 0.490094
H  2.552997 -2.223852 -1.242844
totalener: -3185.06732762 hartree
nucrepener: 1292.05713566 hartree
electener: -4477.12446328 hartree
oneelecener: -6981.86936213 hartree
twoeener: 2504.74489884 hartree
kineticenergy: 3178.83809886 hartree
xcener: -128.501786586216 hartree
chargesum: -0.0000000
charge: 0.016256 -0.361108 -0.395187 -0.120200 -0.144391 0.067380 -0.112620 -0.279718 0.297316 0.336706 -0.270007 0.167528 -0.235246 -0.220540 0.098210 0.071216 0.087112 0.105516 0.091261 0.088927 0.091974 0.070731 0.093663 0.151353 0.069710 0.116732 0.117427
qa: 0.0163 -0.3611 -0.3952 -0.1202 -0.1444 0.0674 -0.1126 -0.2797 0.2973 0.3367 -0.2700 0.1675 -0.2352 -0.2205 0.0982 0.0712 0.0871 0.1055 0.0913 0.0889 0.0920 0.0707 0.0937 0.1514 0.0697 0.1167 0.1174
va: 1.2913 2.1591 2.1148 3.1681 3.2592 3.7953 3.8242 3.9275 4.1987 4.3554 3.9475 3.7373 3.9388 3.9644 1.0398 1.0093 1.0222 1.0142 1.0069 1.0051 1.0055 1.0057 1.0064 1.0362 1.0141 0.9996 0.9989
dispcorr: -0.012637833 hartree
energy: -3185.079965457348
dipole: -46.12738 46.55920 0.43182 -8.18543 6.75857 -1.42686 -3.63766 3.37443 -0.26323
magnitude: 1.51383 au
magnitude: 3.84785 debye
