program: Orca
programVersion: 5.0.3
elementType: Cl N N N N N C C C C C C C C H H H H H H H H H H H H H H
charge: 0
multiplicity: 1
keywords: wb97x-d3
keywords: def2-TZVPP
keywords: def2/J RIJCOSX
keywords: DEFGRID2
keywords: scfconv7
keywords: smallprint printgap noloewdin
keywords: NOSOSCF
formula: C8H14ClN5
InChI: InChI=1/C8H14ClN5/c1-4-10-7-12-6(9)13-8(14-7)11-5(2)3/h5,10-11H,4H2,1-3H3
28 atoms
Cl 3.320119 -1.621486 0.004706
N  -1.533043 -1.577233 -0.075175
N  0.661804 2.447575 0.038724
N  -0.495288 0.474756 -0.002446
N  0.742656 -1.549711 -0.026269
N  1.879899 0.518147 0.019413
C  -2.893599 -1.065792 -0.055552
C  -3.573145 -1.415351 1.261161
C  -3.670744 -1.604701 -1.247615
C  -0.417701 -0.853086 -0.030764
C  -0.539231 3.259034 0.037995
C  0.667033 1.117661 0.017868
C  -0.180339 4.729539 0.071734
C  1.799566 -0.784221 -0.001407
H  -2.826684 0.016894 -0.140658
H  -1.417706 -2.580435 -0.073122
H  -3.641423 -2.497297 1.391981
H  -3.025956 -1.003663 2.109662
H  -4.585672 -1.012046 1.285822
H  -3.732712 -2.694514 -1.21829
H  -3.205341 -1.315069 -2.189797
H  -4.6883 -1.214156 -1.242376
H  -1.134634 3.043441 -0.851434
H  -1.158385 3.008622 0.901509
H  1.556849 2.911483 0.050958
H  0.408822 5.018129 -0.799341
H  -1.089035 5.329428 0.072202
H  0.386812 4.982951 0.967955
elementType: Cl N C H
totalener: -1047.38068430 hartree
nucrepener: 1001.81789895 hartree
electener: -2049.19858324 hartree
oneelecener: -3420.77951874 hartree
twoeener: 1371.58093550 hartree
cpcmener: -0.02291457 hartree
kineticenergy: 1044.15513403 hartree
xcener: -78.348159113327 hartree
chargesum: 0.0000000
charge: -0.070984 -0.179019 -0.185912 -0.461045 -0.410679 -0.408334 0.109994 -0.267797 -0.262098 0.401150 0.016504 0.398236 -0.269394 0.196339 0.074042 0.164809 0.088964 0.092417 0.089667 0.089860 0.093066 0.088022 0.085643 0.085645 0.169133 0.091136 0.089526 0.091112
qa: -0.0710 -0.1790 -0.1859 -0.4610 -0.4107 -0.4083 0.1100 -0.2678 -0.2621 0.4011 0.0165 0.3982 -0.2694 0.1963 0.0740 0.1648 0.0890 0.0924 0.0897 0.0899 0.0931 0.0880 0.0856 0.0856 0.1691 0.0911 0.0895 0.0911
va: 1.2323 3.2179 3.1877 2.9691 2.9579 2.9569 3.8333 3.9422 3.9363 4.2299 3.8606 4.2319 3.9526 4.4707 1.0316 1.0250 1.0043 1.0071 1.0056 1.0038 1.0080 1.0053 0.9982 0.9984 1.0236 1.0002 1.0059 1.0004
dispcorr: -0.009738636 hartree
energy: -1047.390422932441
dipole: -30.92401 28.66031 -2.26370 13.45069 -12.18479 1.26590 0.21829 -0.21483 0.00345
magnitude: 2.59362 au
magnitude: 6.59246 debye
