program: Orca
programVersion: 5.0.3
elementType: Cl N N N N N C C C C C C C C H H H H H H H H H H H H H H
charge: 0
multiplicity: 1
keywords: wb97x-d3
keywords: def2-TZVPP
keywords: def2/J RIJCOSX
keywords: DEFGRID2
keywords: scfconv7
keywords: smallprint printgap noloewdin
keywords: NOSOSCF
formula: C8H14ClN5
InChI: InChI=1/C8H14ClN5/c1-4-10-7-12-6(9)13-8(14-7)11-5(2)3/h5,10-11H,4H2,1-3H3
28 atoms
Cl 3.312956 -1.6183 0.218708
N  -1.523152 -1.498028 -0.160357
N  0.782374 2.471758 -0.410621
N  -0.444834 0.533875 -0.227729
N  0.743659 -1.506374 0.024274
N  1.926446 0.528614 -0.1122
C  -2.872235 -0.958571 -0.20323
C  -3.418234 -0.726199 1.200016
C  -3.756703 -1.909043 -0.993777
C  -0.396109 -0.790639 -0.11719
C  -0.359224 3.360122 -0.407746
C  0.73274 1.150768 -0.241054
C  -0.691715 3.894122 0.975447
C  1.817492 -0.765159 0.018802
H  -2.826508 -0.004157 -0.726957
H  -1.428178 -2.493026 -0.01847
H  -2.777221 -0.053167 1.770167
H  -4.413233 -0.282334 1.1540
H  -3.496142 -1.667126 1.748154
H  -4.780812 -1.538069 -1.020083
H  -3.776258 -2.900562 -0.535815
H  -3.411705 -2.016121 -2.022265
H  -0.133739 4.186978 -1.080634
H  -1.21321 2.835891 -0.829839
H  1.697373 2.889828 -0.342357
H  -1.541327 4.575223 0.922085
H  -0.947923 3.087026 1.662465
H  0.150766 4.444777 1.39601
elementType: Cl N C H
totalener: -1047.38038137 hartree
nucrepener: 1011.35561603 hartree
electener: -2058.73599740 hartree
oneelecener: -3439.87149861 hartree
twoeener: 1381.13550121 hartree
cpcmener: -0.02273932 hartree
kineticenergy: 1044.15852615 hartree
xcener: -78.348309941720 hartree
chargesum: 0.0000000
charge: -0.068832 -0.183684 -0.194592 -0.461426 -0.411220 -0.406779 0.124566 -0.278022 -0.258396 0.402180 0.012011 0.392701 -0.256818 0.196232 0.064665 0.166388 0.090689 0.092228 0.088694 0.087007 0.091425 0.096497 0.097595 0.085391 0.173618 0.090033 0.081993 0.085855
qa: -0.0688 -0.1837 -0.1946 -0.4614 -0.4112 -0.4068 0.1246 -0.2780 -0.2584 0.4022 0.0120 0.3927 -0.2568 0.1962 0.0647 0.1664 0.0907 0.0922 0.0887 0.0870 0.0914 0.0965 0.0976 0.0854 0.1736 0.0900 0.0820 0.0859
va: 1.2348 3.2112 3.2156 2.9567 2.9620 2.9564 3.8398 3.9378 3.9203 4.2164 3.8593 4.2332 3.9331 4.4718 1.0230 1.0247 1.0081 1.0062 1.0056 1.0055 1.0031 1.0082 0.9973 1.0148 1.0173 1.0080 1.0049 1.0045
dispcorr: -0.010272567 hartree
energy: -1047.390653936759
dipole: -31.64275 29.44093 -2.20182 12.53952 -11.29139 1.24813 1.63839 -1.73608 -0.09769
magnitude: 2.53286 au
magnitude: 6.43801 debye
