program: Orca
programVersion: 5.0.3
elementType: Cl N N N N N C C C C C C C C H H H H H H H H H H H H H H
charge: 0
multiplicity: 1
keywords: wb97x-d3
keywords: def2-TZVPP
keywords: def2/J RIJCOSX
keywords: DEFGRID2
keywords: scfconv7
keywords: smallprint printgap noloewdin
keywords: NOSOSCF
formula: C8H14ClN5
InChI: InChI=1/C8H14ClN5/c1-4-10-7-12-6(9)13-8(14-7)11-5(2)3/h5,10-11H,4H2,1-3H3
28 atoms
Cl 2.751194 -1.908347 0.179017
N  -1.931253 -0.58526 -0.193194
N  1.177288 2.659554 0.643301
N  -0.421919 1.066377 0.218347
N  0.280144 -1.191178 0.013747
N  1.875597 0.503642 0.403964
C  -2.439996 -1.947144 -0.255958
C  -3.670622 -1.971893 -1.147142
C  -2.748534 -2.48634 1.134307
C  -0.665589 -0.231629 0.025185
C  0.255301 3.77469 0.591512
C  0.849909 1.389393 0.408118
C  -0.010988 4.285503 -0.813679
C  1.487246 -0.723307 0.203632
H  -1.667684 -2.565455 -0.712112
H  -2.614692 0.152331 -0.099964
H  -4.074288 -2.982748 -1.20341
H  -4.457327 -1.323932 -0.754572
H  -3.4375 -1.64844 -2.161153
H  -3.108796 -3.514197 1.07421
H  -3.522104 -1.887962 1.620559
H  -1.864372 -2.479156 1.772964
H  -0.677521 3.486092 1.073363
H  0.685691 4.569106 1.199766
H  2.162387 2.861185 0.711588
H  0.908245 4.621943 -1.295004
H  -0.462726 3.517616 -1.441907
H  -0.696758 5.132886 -0.776554
elementType: Cl N C H
totalener: -1047.38002914 hartree
nucrepener: 1008.94295577 hartree
electener: -2056.32298492 hartree
oneelecener: -3435.17663747 hartree
twoeener: 1378.85365256 hartree
cpcmener: -0.02236313 hartree
kineticenergy: 1044.15533353 hartree
xcener: -78.347424023947 hartree
chargesum: -0.0000000
charge: -0.067963 -0.189203 -0.197040 -0.464782 -0.415194 -0.401402 0.127929 -0.258358 -0.278616 0.407101 0.014845 0.407963 -0.260292 0.187665 0.062351 0.167234 0.087509 0.090776 0.096218 0.091892 0.088603 0.091221 0.080085 0.099400 0.174561 0.084600 0.082363 0.090535
qa: -0.0680 -0.1892 -0.1970 -0.4648 -0.4152 -0.4014 0.1279 -0.2584 -0.2786 0.4071 0.0148 0.4080 -0.2603 0.1877 0.0624 0.1672 0.0875 0.0908 0.0962 0.0919 0.0886 0.0912 0.0801 0.0994 0.1746 0.0846 0.0824 0.0905
va: 1.2372 3.2145 3.2118 2.9653 2.9225 2.9658 3.8314 3.9174 3.9377 4.1990 3.8530 4.2078 3.9182 4.4761 1.0288 1.0230 1.0053 1.0030 1.0086 1.0064 1.0056 1.0089 1.0175 0.9974 1.0173 1.0053 1.0094 1.0073
dispcorr: -0.010065583 hartree
energy: -1047.390094724081
dipole: -25.36962 23.60300 -1.76663 10.03422 -8.53920 1.49502 -2.38798 2.41971 0.03172
magnitude: 2.31453 au
magnitude: 5.88307 debye
