program: Orca
programVersion: 5.0.3
elementType: Cl N N N N N C C C C C C C C H H H H H H H H H H H H H H
charge: 0
multiplicity: 1
keywords: wb97x-d3
keywords: def2-TZVPP
keywords: def2/J RIJCOSX
keywords: DEFGRID2
keywords: scfconv7
keywords: smallprint printgap noloewdin
keywords: NOSOSCF
formula: C8H14ClN5
InChI: InChI=1/C8H14ClN5/c1-4-10-7-12-6(9)13-8(14-7)11-5(2)3/h5,10-11H,4H2,1-3H3
28 atoms
Cl 3.327923 -1.643528 0.114886
N  -1.521022 -1.507897 -0.116983
N  0.778473 2.461487 -0.346755
N  -0.439063 0.518254 -0.189751
N  0.752958 -1.524826 -0.007708
N  1.932375 0.511056 -0.136288
C  -2.865052 -0.959558 -0.184679
C  -3.439592 -0.732443 1.208114
C  -3.737353 -1.894947 -1.006969
C  -0.38889 -0.80763 -0.104866
C  -0.368116 3.34134 -0.386811
C  0.737363 1.13607 -0.220459
C  -0.700432 3.942771 0.968567
C  1.827602 -0.785048 -0.02705
H  -2.797814 0.000358 -0.697602
H  -1.424491 -2.506767 -0.006197
H  -2.820815 -0.044289 1.78525
H  -4.44137 -0.304993 1.144916
H  -3.511188 -1.671215 1.761325
H  -4.749813 -1.498925 -1.085134
H  -3.805036 -2.883038 -0.54551
H  -3.34687 -2.01857 -2.017768
H  -0.152229 4.134194 -1.103911
H  -1.219536 2.786177 -0.774929
H  1.69635 2.878374 -0.324189
H  -1.547539 4.624281 0.881264
H  -0.963524 3.171038 1.692672
H  0.142057 4.510386 1.366473
elementType: Cl N C H
totalener: -1047.38861346 hartree
nucrepener: 1010.47788738 hartree
electener: -2057.86650085 hartree
oneelecener: -3438.09579266 hartree
twoeener: 1380.22929181 hartree
cpcmener: -0.01993424 hartree
kineticenergy: 1044.15507119 hartree
xcener: -78.348261376075 hartree
chargesum: 0.0000000
charge: -0.067278 -0.184718 -0.191932 -0.461148 -0.405947 -0.402852 0.116269 -0.273672 -0.256198 0.404079 0.005123 0.394465 -0.253032 0.194796 0.064445 0.164734 0.091196 0.090248 0.087334 0.086618 0.089933 0.097582 0.096190 0.087568 0.171608 0.088191 0.082411 0.083987
qa: -0.0673 -0.1847 -0.1919 -0.4611 -0.4059 -0.4029 0.1163 -0.2737 -0.2562 0.4041 0.0051 0.3945 -0.2530 0.1948 0.0644 0.1647 0.0912 0.0902 0.0873 0.0866 0.0899 0.0976 0.0962 0.0876 0.1716 0.0882 0.0824 0.0840
va: 1.2357 3.2059 3.2100 2.9576 2.9661 2.9601 3.8489 3.9341 3.9199 4.2119 3.8596 4.2282 3.9321 4.4731 1.0231 1.0264 1.0087 1.0063 1.0066 1.0060 1.0031 1.0081 0.9969 1.0150 1.0194 1.0083 1.0053 1.0050
dispcorr: -0.010229896 hartree
energy: -1047.398843361156
dipole: -31.75142 29.60461 -2.14682 12.78562 -11.56001 1.22561 1.90209 -2.03326 -0.13117
magnitude: 2.47551 au
magnitude: 6.29225 debye
