program: Orca
programVersion: 4.2.1
elementType: O O N N N N N C C C C C C C C C C H H H H H H H H H H H H H H H H H H H
charge: 0
multiplicity: 1
keywords: wb97x-d3
keywords: def2-TZVPP
keywords: def2/J RIJCOSX GRIDX6 NOFINALGRIDX
keywords: grid4 nofinalgrid
keywords: scfconv7
keywords: smallprint printgap noloewdin
keywords: NOSOSCF
formula: C10H19N5O2
InChI: InChI=1/C10H19N5O2/c1-6(2)7-13-15(9(17)14(7)11)8(16)12-10(3,4)5/h6,12H,11H2,1-5H3
36 atoms
O  1.986342 1.578797 -0.067221
O  -0.536077 2.94102 -0.105903
N  1.783027 -0.695813 0.014063
N  -0.08077 0.629268 -0.029226
N  -2.127761 1.256622 -0.043967
N  -0.846301 -0.50779 0.011169
N  -3.280573 2.00389 -0.067879
C  3.197351 -1.093977 0.030795
C  -3.258198 -1.005494 0.034855
C  -2.068251 -0.108499 0.002182
C  3.904475 -0.547278 1.269389
C  3.193343 -2.618846 0.084502
C  3.909411 -0.636272 -1.240536
C  1.32889 0.555333 -0.029866
C  -0.847244 1.768662 -0.065822
C  -3.275549 -1.908011 -1.196855
C  -3.274553 -1.819529 1.326882
H  -4.142887 -0.367736 0.013046
H  1.093354 -1.432334 0.046948
H  4.92944 -0.919231 1.303388
H  3.950133 0.540702 1.270702
H  3.403321 -0.870325 2.182845
H  2.694869 -3.048049 -0.786809
H  2.689122 -2.985924 0.980523
H  4.214932 -2.997215 0.101358
H  3.954195 0.448744 -1.319555
H  4.934768 -1.008436 -1.243393
H  3.412466 -1.024223 -2.130737
H  -2.413223 -2.574771 -1.211264
H  -3.271152 -1.329397 -2.120757
H  -4.17507 -2.523314 -1.194023
H  -3.275559 -1.177432 2.207868
H  -2.409344 -2.479724 1.389986
H  -4.171503 -2.4375 1.364983
H  -3.287487 2.63385 0.723637
H  -3.304631 2.554369 -0.916087
elementType: O N C H
totalener: -816.84231191 hartree
nucrepener: 1310.29002857 hartree
electener: -2127.13234047 hartree
oneelecener: -3712.42523164 hartree
twoeener: 1585.29289117 hartree
cpcmener: -0.04589186 hartree
kineticenergy: 813.33730290 hartree
xcener: -78.092210091083 hartree
chargesum: 0.0000000
charge: -0.525800 -0.512143 -0.218625 0.062275 0.020334 -0.386520 -0.290349 0.196962 0.075178 0.213210 -0.308601 -0.298267 -0.309280 0.413347 0.353204 -0.287034 -0.287425 0.056015 0.177564 0.096910 0.102343 0.098676 0.109712 0.109341 0.095641 0.102687 0.096894 0.099069 0.089363 0.103815 0.097025 0.104331 0.090004 0.096510 0.181693 0.181939
qa: -0.5258 -0.5121 -0.2186 0.0623 0.0203 -0.3865 -0.2903 0.1970 0.0752 0.2132 -0.3086 -0.2983 -0.3093 0.4133 0.3532 -0.2870 -0.2874 0.0560 0.1776 0.0969 0.1023 0.0987 0.1097 0.1093 0.0956 0.1027 0.0969 0.0991 0.0894 0.1038 0.0970 0.1043 0.0900 0.0965 0.1817 0.1819
va: 1.9879 2.0029 3.2427 3.1280 3.2955 2.9252 3.0061 3.8671 3.8275 4.0249 3.8961 3.8965 3.8952 4.3102 4.3982 3.9429 3.9427 1.0516 1.0296 1.0050 1.0193 1.0095 1.0036 1.0038 1.0085 1.0194 1.0051 1.0093 1.0077 1.0027 1.0037 1.0023 1.0075 1.0039 1.0028 1.0023
dispcorr: -0.015578495 hartree
energy: -816.857890401144
dipole: 4.66837 -6.75741 -2.08904 -19.59764 16.83139 -2.76626 0.70266 -0.60587 0.09680
magnitude: 3.46780 au
magnitude: 8.81444 debye
