program: Orca
programVersion: 4.2.1
elementType: O O N N N N N C C C C C C C C C C H H H H H H H H H H H H H H H H H H H
charge: 0
multiplicity: 1
keywords: wb97x-d3
keywords: def2-TZVPP
keywords: def2/J RIJCOSX GRIDX6 NOFINALGRIDX
keywords: grid4 nofinalgrid
keywords: scfconv7
keywords: smallprint printgap noloewdin
keywords: NOSOSCF
formula: C10H19N5O2
InChI: InChI=1/C10H19N5O2/c1-6(2)7-13-15(9(17)14(7)11)8(16)12-10(3,4)5/h6,12H,11H2,1-5H3
36 atoms
O  1.994732 1.58322 -0.063409
O  -0.544266 2.953372 -0.109015
N  1.779934 -0.690095 0.014523
N  -0.07824 0.642882 -0.028955
N  -2.128071 1.263728 -0.045309
N  -0.841724 -0.49526 0.012086
N  -3.283422 2.004683 -0.068998
C  3.19079 -1.096254 0.031002
C  -3.249682 -1.005989 0.03574
C  -2.064376 -0.100195 0.002552
C  3.899497 -0.553906 1.271263
C  3.177412 -2.621859 0.083623
C  3.904064 -0.641073 -1.241222
C  1.332463 0.566511 -0.028266
C  -0.846902 1.7826 -0.067716
C  -3.260094 -1.910193 -1.195314
C  -3.258718 -1.822497 1.326711
H  -4.139299 -0.374034 0.014489
H  1.084128 -1.421109 0.044429
H  4.921898 -0.933048 1.312649
H  3.952682 0.533949 1.271179
H  3.390146 -0.870252 2.183141
H  2.675648 -3.048177 -0.78785
H  2.6710 -2.987375 0.979658
H  4.195887 -3.009533 0.099885
H  3.955922 0.44406 -1.317375
H  4.92703 -1.020554 -1.251716
H  3.398802 -1.021245 -2.130698
H  -2.386387 -2.562818 -1.214941
H  -3.271094 -1.334434 -2.121426
H  -4.149586 -2.540902 -1.188261
H  -3.274665 -1.183683 2.210451
H  -2.382334 -2.46842 1.393357
H  -4.145697 -2.455907 1.361527
H  -3.296377 2.63668 0.720901
H  -3.317797 2.55127 -0.919479
elementType: O N C H
totalener: -816.84717743 hartree
nucrepener: 1310.35431223 hartree
electener: -2127.20148965 hartree
oneelecener: -3712.52828774 hartree
twoeener: 1585.32679809 hartree
cpcmener: -0.03632412 hartree
kineticenergy: 813.33238687 hartree
xcener: -78.088585742520 hartree
chargesum: 0.0000000
charge: -0.490135 -0.473130 -0.223943 0.058528 0.016115 -0.384756 -0.289144 0.193473 0.074119 0.208394 -0.306060 -0.299371 -0.306728 0.396152 0.331250 -0.286095 -0.286560 0.055901 0.173906 0.094964 0.104714 0.096372 0.108414 0.108094 0.094919 0.104988 0.094935 0.096771 0.089743 0.102688 0.095571 0.103287 0.090279 0.095138 0.178463 0.178742
qa: -0.4901 -0.4731 -0.2239 0.0585 0.0161 -0.3848 -0.2891 0.1935 0.0741 0.2084 -0.3061 -0.2994 -0.3067 0.3962 0.3313 -0.2861 -0.2866 0.0559 0.1739 0.0950 0.1047 0.0964 0.1084 0.1081 0.0949 0.1050 0.0949 0.0968 0.0897 0.1027 0.0956 0.1033 0.0903 0.0951 0.1785 0.1787
va: 2.0325 2.0542 3.2245 3.1157 3.2819 2.9269 3.0106 3.8785 3.8303 4.0285 3.8923 3.8970 3.8918 4.3303 4.4245 3.9434 3.9430 1.0510 1.0326 1.0053 1.0197 1.0102 1.0038 1.0041 1.0089 1.0198 1.0054 1.0099 1.0079 1.0030 1.0039 1.0026 1.0078 1.0041 1.0048 1.0042
dispcorr: -0.015602038 hartree
energy: -816.862779466878
dipole: 4.64042 -6.63890 -1.99848 -19.72654 17.18677 -2.53977 0.69779 -0.61533 0.08245
magnitude: 3.23282 au
magnitude: 8.21718 debye
