program: Orca
programVersion: 4.2.1
elementType: O O N N N N N C C C C C C C C C C H H H H H H H H H H H H H H H H H H H
charge: 0
multiplicity: 1
keywords: wb97x-d3
keywords: def2-TZVPP
keywords: def2/J RIJCOSX GRIDX6 NOFINALGRIDX
keywords: grid4 nofinalgrid
keywords: scfconv7
keywords: smallprint printgap noloewdin
keywords: NOSOSCF
formula: C10H19N5O2
InChI: InChI=1/C10H19N5O2/c1-6(2)7-13-15(9(17)14(7)11)8(16)12-10(3,4)5/h6,12H,11H2,1-5H3
36 atoms
O  1.417229 -1.894201 0.003521
O  0.068797 2.140336 -0.006622
N  2.151236 0.26826 -0.003363
N  -0.112496 -0.206182 -0.002456
N  -1.918369 0.947925 -0.003511
N  -1.147306 -1.097514 -0.000328
N  -2.815661 1.989915 -0.004005
C  3.598899 0.036876 0.000394
C  -3.593278 -0.975033 0.000638
C  -2.22018 -0.395222 -0.001037
C  4.033393 -0.725546 -1.252023
C  4.240808 1.423407 -0.004906
C  4.028595 -0.713924 1.261464
C  1.228919 -0.707253 -0.000714
C  -0.550109 1.093152 -0.0045
C  -4.366828 -0.608948 1.267395
C  -4.370877 -0.60856 -1.263524
H  -3.425806 -2.054729 0.00022
H  1.828052 1.22688 -0.005623
H  3.61449 -1.729044 -1.276487
H  3.719391 -0.199376 -2.154557
H  5.120578 -0.814475 -1.276967
H  3.954133 2.000798 0.87646
H  3.957341 1.992414 -0.892714
H  5.32669 1.335196 -0.002486
H  3.609133 -1.716991 1.293748
H  5.115628 -0.803159 1.291302
H  3.711532 -0.179179 2.157868
H  -4.584978 0.457225 1.307768
H  -3.814755 -0.885333 2.165726
H  -5.317089 -1.1431 1.287359
H  -3.820682 -0.882194 -2.163862
H  -4.59161 0.457155 -1.301558
H  -5.319975 -1.144846 -1.281864
H  -2.654082 2.566947 0.8120
H  -2.659151 2.562033 -0.824448
totalener: -816.82479619 hartree
nucrepener: 1308.69834542 hartree
electener: -2125.52314160 hartree
oneelecener: -3708.94151042 hartree
twoeener: 1583.41836882 hartree
kineticenergy: 813.36663734 hartree
xcener: -78.086516824983 hartree
chargesum: 0.0000000
charge: -0.375452 -0.447177 -0.255531 0.029136 -0.043956 -0.219212 -0.253042 0.172370 0.065474 0.141618 -0.288977 -0.292488 -0.289145 0.350140 0.312820 -0.286770 -0.286997 0.064609 0.174288 0.117800 0.085806 0.081171 0.102144 0.102230 0.086782 0.117777 0.081297 0.085809 0.090782 0.102785 0.088376 0.102738 0.090792 0.088455 0.151744 0.151804
qa: -0.3755 -0.4472 -0.2555 0.0291 -0.0440 -0.2192 -0.2530 0.1724 0.0655 0.1416 -0.2890 -0.2925 -0.2891 0.3501 0.3128 -0.2868 -0.2870 0.0646 0.1743 0.1178 0.0858 0.0812 0.1021 0.1022 0.0868 0.1178 0.0813 0.0858 0.0908 0.1028 0.0884 0.1027 0.0908 0.0885 0.1517 0.1518
va: 2.1508 2.0735 3.1868 3.1532 3.2704 2.9878 3.0403 3.9394 3.8270 4.0949 3.8873 3.9009 3.8878 4.3644 4.3753 3.9179 3.9178 1.0388 1.0544 1.0203 1.0133 1.0071 1.0069 1.0070 1.0112 1.0202 1.0071 1.0133 1.0133 1.0055 1.0062 1.0054 1.0133 1.0062 1.0215 1.0214
dispcorr: -0.015956582 hartree
energy: -816.840752770090
dipole: 3.67560 -4.62135 -0.94575 0.59228 0.70884 1.30113 0.02516 -0.02793 -0.00277
magnitude: 1.60853 au
magnitude: 4.08857 debye
