program: Orca
programVersion: 5.0.3
elementType: S N N N N N C C C C C C C C C H H H H H H H H H H H H H H H H H
charge: 0
multiplicity: 1
keywords: wb97x-d3
keywords: def2-TZVPP
keywords: def2/J RIJCOSX
keywords: DEFGRID2
keywords: scfconv7
keywords: smallprint printgap noloewdin
keywords: NOSOSCF
formula: C9H17N5S
InChI: InChI=1/C9H17N5S/c1-5-10-7-12-8(11-6(2)3)14-9(13-7)15-4/h6,10-11H,5H2,1-4H3
32 atoms
S  -0.056674 2.840175 0.155783
N  -1.98439 -1.628676 -0.107014
N  2.534331 -1.338707 -0.512793
N  0.277808 -1.511848 -0.290359
N  -1.009176 0.455375 0.007522
N  1.343753 0.603723 -0.169198
C  -3.351063 -1.17058 0.067321
C  -3.935537 -1.730513 1.356215
C  -4.193426 -1.55375 -1.14108
C  -0.883122 -0.872901 -0.128865
C  1.357479 -0.733445 -0.309558
C  3.8320 -0.717097 -0.368097
C  0.137569 1.110843 -0.024216
C  4.389875 -0.812671 1.041696
C  1.630689 3.464098 0.063462
H  -3.316723 -0.085667 0.140422
H  -1.842779 -2.622893 -0.208653
H  -3.357641 -1.41236 2.224512
H  -4.961421 -1.386971 1.49268
H  -3.950186 -2.822459 1.339546
H  -3.798983 -1.1117 -2.056472
H  -5.219499 -1.20629 -1.017447
H  -4.223191 -2.637612 -1.273122
H  4.510538 -1.204467 -1.068042
H  3.759933 0.322099 -0.679375
H  2.504656 -2.346525 -0.518186
H  3.734022 -0.323224 1.762663
H  4.512312 -1.852877 1.346757
H  5.367642 -0.332829 1.095571
H  2.091875 3.237621 -0.894448
H  2.247119 3.080406 0.872316
H  1.554649 4.545331 0.166454
elementType: S N C H
totalener: -1025.28844931 hartree
nucrepener: 1130.18071796 hartree
electener: -2155.46916727 hartree
oneelecener: -3645.51664643 hartree
twoeener: 1490.04747916 hartree
cpcmener: -0.02305609 hartree
kineticenergy: 1021.81403465 hartree
xcener: -80.778570156663 hartree
chargesum: -0.0000000
charge: -0.052366 -0.188967 -0.206824 -0.462666 -0.425229 -0.449165 0.108991 -0.265470 -0.263799 0.392577 0.376444 0.008768 0.211457 -0.257681 -0.251955 0.068585 0.158708 0.091623 0.087702 0.087989 0.091100 0.087266 0.088348 0.096029 0.084039 0.166275 0.081437 0.085503 0.088982 0.114414 0.114330 0.133554
qa: -0.0524 -0.1890 -0.2068 -0.4627 -0.4252 -0.4492 0.1090 -0.2655 -0.2638 0.3926 0.3764 0.0088 0.2115 -0.2577 -0.2520 0.0686 0.1587 0.0916 0.0877 0.0880 0.0911 0.0873 0.0883 0.0960 0.0840 0.1663 0.0814 0.0855 0.0890 0.1144 0.1143 0.1336
va: 2.4018 3.1938 3.1934 2.9675 2.9502 2.9314 3.8205 3.9372 3.9362 4.2442 4.2522 3.8639 4.3061 3.9320 3.9684 1.0462 1.0289 1.0078 1.0057 1.0042 1.0082 1.0056 1.0037 0.9973 1.0159 1.0217 1.0056 1.0043 1.0083 1.0076 1.0077 1.0015
dispcorr: -0.011630386 hartree
energy: -1025.300079693309
dipole: -0.48723 1.33518 0.84795 -7.66571 6.56868 -1.09703 2.58720 -2.59450 -0.00730
magnitude: 1.38656 au
magnitude: 3.52436 debye
