program: Orca
programVersion: 5.0.2
elementType: Cl Cl F F F F O O C C C C C C C C C C C C C C C H H H H H H H H H H H H
charge: 0
multiplicity: 1
keywords: wb97x-d3
keywords: def2-TZVPP
keywords: def2/J RIJCOSX
keywords: DEFGRID2
keywords: scfconv7
keywords: smallprint printgap noloewdin
keywords: NOSOSCF
formula: C15H12Cl2F4O2
InChI: InChI=1/C15H12Cl2F4O2/c1-15(2)7(3-10(16)17)11(15)14(22)23-5-6-12(20)8(18)4-9(19)13(6)21/h3-4,7,11H,5H2,1-2H3
35 atoms
Cl -2.328224 2.230507 0.978849
Cl -4.907379 2.303872 -0.309239
F  2.242894 -1.4783 1.654767
F  2.83577 0.552333 -2.541876
F  4.169839 2.555086 -1.379324
F  3.580857 0.536426 2.816036
O  0.366295 -1.381059 -0.823821
O  -0.256907 -3.198159 -1.958297
C  -2.433759 -2.19908 0.519915
C  -1.924491 -1.912106 -0.874193
C  -2.260146 -0.773512 0.059498
C  -1.481668 -2.702263 1.576465
C  -3.815879 -2.793326 0.62969
C  -3.407669 0.085319 -0.252287
C  -0.537644 -2.240117 -1.276489
C  -3.522194 1.361845 0.091333
C  1.746113 -1.65145 -1.096375
C  2.518204 -0.529659 -0.474807
C  2.720084 -0.491537 0.896236
C  3.015311 0.525081 -1.22186
C  3.703726 1.56371 -0.621581
C  3.405626 0.546368 1.495361
C  3.905197 1.586665 0.740691
H  -2.636285 -2.122691 -1.665376
H  -1.412711 -0.265511 0.502691
H  -0.50973 -2.212251 1.549202
H  -1.903845 -2.528677 2.56731
H  -1.321466 -3.776424 1.470799
H  -4.291355 -2.483969 1.56202
H  -4.470357 -2.50708 -0.192153
H  -3.756946 -3.882672 0.634176
H  -4.228926 -0.344421 -0.813346
H  1.920936 -1.703944 -2.170108
H  2.037437 -2.610005 -0.665191
H  4.441863 2.402656 1.207063
elementType: Cl F O C H
totalener: -2049.15532937 hartree
nucrepener: 2257.27048692 hartree
electener: -4306.42581628 hartree
oneelecener: -7310.30124900 hartree
twoeener: 3003.87543272 hartree
cpcmener: -0.02567156 hartree
kineticenergy: 2043.55581864 hartree
xcener: -143.166643238453 hartree
chargesum: 0.0000000
charge: -0.060252 -0.062849 -0.204132 -0.202876 -0.203429 -0.203258 -0.263329 -0.484114 0.073259 -0.096633 0.060711 -0.249882 -0.270630 -0.219153 0.429207 0.042213 0.063228 -0.201051 0.258517 0.269366 0.185405 0.193160 -0.151364 0.107727 0.077745 0.079164 0.098935 0.100986 0.100690 0.092220 0.098153 0.134324 0.118336 0.134316 0.155293
qa: -0.0603 -0.0628 -0.2041 -0.2029 -0.2034 -0.2033 -0.2633 -0.4841 0.0733 -0.0966 0.0607 -0.2499 -0.2706 -0.2192 0.4292 0.0422 0.0632 -0.2011 0.2585 0.2694 0.1854 0.1932 -0.1514 0.1077 0.0777 0.0792 0.0989 0.1010 0.1007 0.0922 0.0982 0.1343 0.1183 0.1343 0.1553
va: 1.2651 1.2427 1.0963 1.1001 1.0844 1.0856 2.1346 2.0133 3.7674 3.8687 3.8211 3.9049 3.9018 3.8922 4.1548 4.2032 3.8086 3.7223 3.8555 3.8880 3.9611 3.9801 3.8580 1.0261 1.0391 1.0173 1.0012 1.0023 1.0004 1.0051 1.0015 1.0161 1.0114 1.0019 0.9977
dispcorr: -0.017314789 hartree
energy: -2049.172644153613
dipole: -17.20584 17.37196 0.16613 -28.71196 28.44095 -0.27101 2.34437 -1.63670 0.70767
magnitude: 0.77578 au
magnitude: 1.97188 debye
