program: Orca
programVersion: 5.0.2
elementType: Cl Cl F F F F O O C C C C C C C C C C C C C C C H H H H H H H H H H H H
charge: 0
multiplicity: 1
keywords: wb97x-d3
keywords: def2-TZVPP
keywords: def2/J RIJCOSX
keywords: DEFGRID2
keywords: scfconv7
keywords: smallprint printgap noloewdin
keywords: NOSOSCF
formula: C15H12Cl2F4O2
InChI: InChI=1/C15H12Cl2F4O2/c1-15(2)7(3-10(16)17)11(15)14(22)23-5-6-12(20)8(18)4-9(19)13(6)21/h3-4,7,11H,5H2,1-2H3
35 atoms
Cl -1.408952 1.919007 1.528344
Cl -3.960224 2.805388 0.513357
F  1.049457 -0.246421 1.857727
F  3.611404 -1.27006 -1.952293
F  4.459126 1.26084 -2.048848
F  1.820316 2.309048 1.69188
O  0.334392 -2.240414 0.059995
O  0.227315 -1.684339 -2.096346
C  -2.68936 -2.295538 0.16903
C  -1.764346 -1.631205 -0.827657
C  -2.246161 -0.889759 0.423102
C  -2.219871 -3.372645 1.118112
C  -4.087478 -2.554166 -0.34337
C  -3.128497 0.272236 0.262409
C  -0.32222 -1.860943 -1.032144
C  -2.862804 1.492605 0.711684
C  1.761044 -2.234825 0.018716
C  2.280873 -0.826343 -0.058252
C  1.863561 0.118642 0.86811
C  3.160038 -0.406365 -1.042001
C  3.598141 0.904875 -1.095783
C  2.274674 1.434288 0.79349
C  3.152275 1.841903 -0.189184
H  -2.247394 -1.331577 -1.750507
H  -1.492674 -0.790564 1.194838
H  -2.996093 -3.549062 1.864598
H  -2.053951 -4.312932 0.590257
H  -1.310628 -3.116229 1.654452
H  -4.143929 -3.550737 -0.78351
H  -4.807896 -2.512759 0.475335
H  -4.404056 -1.845609 -1.107956
H  -4.067028 0.139104 -0.261814
H  2.131773 -2.847695 -0.801167
H  2.072656 -2.707602 0.948355
H  3.488223 2.869256 -0.244448
elementType: Cl F O C H
totalener: -2049.15215204 hartree
nucrepener: 2361.56272172 hartree
electener: -4410.71487376 hartree
oneelecener: -7519.82445914 hartree
twoeener: 3109.10958538 hartree
cpcmener: -0.02605057 hartree
kineticenergy: 2043.54789068 hartree
xcener: -143.167608660074 hartree
chargesum: 0.0000000
charge: -0.063098 -0.062394 -0.199055 -0.203982 -0.204236 -0.205109 -0.273794 -0.485708 0.118903 -0.059551 -0.029519 -0.261126 -0.292503 -0.176571 0.411694 0.040372 0.056484 -0.115038 0.193222 0.248032 0.201700 0.196683 -0.166567 0.098269 0.099417 0.095176 0.102118 0.091003 0.100949 0.105505 0.093838 0.129850 0.125747 0.133385 0.155903
qa: -0.0631 -0.0624 -0.1991 -0.2040 -0.2042 -0.2051 -0.2738 -0.4857 0.1189 -0.0596 -0.0295 -0.2611 -0.2925 -0.1766 0.4117 0.0404 0.0565 -0.1150 0.1932 0.2480 0.2017 0.1967 -0.1666 0.0983 0.0994 0.0952 0.1021 0.0910 0.1009 0.1055 0.0938 0.1298 0.1257 0.1334 0.1559
va: 1.2837 1.2442 1.0984 1.0948 1.0840 1.0823 2.1174 2.0195 3.7634 3.8017 3.8910 3.8881 3.9252 3.8712 4.1633 4.2132 3.8473 3.5739 3.9117 3.9058 3.9523 3.9464 3.8831 1.0279 1.0287 0.9997 1.0009 1.0154 1.0004 0.9989 1.0035 1.0209 1.0153 0.9986 0.9976
dispcorr: -0.019353934 hartree
energy: -2049.171505970517
dipole: -21.41733 20.87238 -0.54496 -30.39875 29.18336 -1.21540 -1.08387 2.05799 0.97412
magnitude: 1.65017 au
magnitude: 4.19441 debye
