program: Orca
programVersion: 5.0.2
elementType: Cl Cl F F F F O O C C C C C C C C C C C C C C C H H H H H H H H H H H H
charge: 0
multiplicity: 1
keywords: wb97x-d3
keywords: def2-TZVPP
keywords: def2/J RIJCOSX
keywords: DEFGRID2
keywords: scfconv7
keywords: smallprint printgap noloewdin
keywords: NOSOSCF
formula: C15H12Cl2F4O2
InChI: InChI=1/C15H12Cl2F4O2/c1-15(2)7(3-10(16)17)11(15)14(22)23-5-6-12(20)8(18)4-9(19)13(6)21/h3-4,7,11H,5H2,1-2H3
35 atoms
Cl -2.812664 -2.43608 1.360873
Cl -4.688758 -0.561097 2.494972
F  4.104153 1.071622 -1.918705
F  1.077904 -1.06052 0.993963
F  2.422471 -0.095918 3.082696
F  5.476132 1.976287 0.177119
O  0.374752 -0.362499 -1.573186
O  0.59375 1.851227 -1.732982
C  -2.608765 0.327849 -2.217729
C  -1.558601 0.958198 -1.327424
C  -2.370666 -0.227642 -0.841575
C  -2.204617 -0.52209 -3.39749
C  -3.831689 1.168038 -2.493008
C  -3.315423 -0.021854 0.261317
C  -0.104309 0.876813 -1.571648
C  -3.565369 -0.892612 1.231114
C  1.780227 -0.541537 -1.715355
C  2.541025 -0.013218 -0.530861
C  3.673853 0.767276 -0.693724
C  2.150658 -0.300655 0.769102
C  2.851958 0.190066 1.85375
C  4.387519 1.237807 0.392526
C  3.982963 0.959185 1.679798
H  -1.840455 1.92617 -0.928271
H  -1.842844 -1.1732 -0.825922
H  -1.407767 -1.226846 -3.17025
H  -3.063086 -1.102368 -3.739979
H  -1.878046 0.104331 -4.229609
H  -3.676396 1.769184 -3.390277
H  -4.700436 0.531075 -2.667391
H  -4.073502 1.853535 -1.681824
H  -3.850117 0.919208 0.304869
H  2.131333 -0.090123 -2.64199
H  1.91934 -1.61807 -1.80166
H  4.537097 1.33199 2.531392
elementType: Cl F O C H
totalener: -2049.15350964 hartree
nucrepener: 2278.78592988 hartree
electener: -4327.93943951 hartree
oneelecener: -7354.22493836 hartree
twoeener: 3026.28549884 hartree
cpcmener: -0.02708939 hartree
kineticenergy: 2043.55206409 hartree
xcener: -143.169029429691 hartree
chargesum: 0.0000000
charge: -0.059253 -0.062895 -0.204342 -0.202963 -0.204341 -0.204426 -0.276096 -0.480278 0.074953 -0.086507 0.054844 -0.262565 -0.274154 -0.216629 0.431445 0.044245 0.052175 -0.110737 0.237367 0.213048 0.191791 0.199067 -0.173163 0.101054 0.079431 0.094076 0.097793 0.101835 0.098333 0.101067 0.093677 0.132546 0.128030 0.134806 0.156767
qa: -0.0593 -0.0629 -0.2043 -0.2030 -0.2043 -0.2044 -0.2761 -0.4803 0.0750 -0.0865 0.0548 -0.2626 -0.2742 -0.2166 0.4314 0.0442 0.0522 -0.1107 0.2374 0.2130 0.1918 0.1991 -0.1732 0.1011 0.0794 0.0941 0.0978 0.1018 0.0983 0.1011 0.0937 0.1325 0.1280 0.1348 0.1568
va: 1.2659 1.2421 1.0936 1.0937 1.0847 1.0837 2.1197 2.0255 3.7741 3.8272 3.8099 3.9035 3.9113 3.8937 4.1422 4.2082 3.8483 3.5645 3.9087 3.9246 3.9655 3.9564 3.8682 1.0283 1.0468 1.0135 1.0000 0.9999 1.0008 1.0005 1.0056 1.0190 1.0139 0.9950 0.9974
dispcorr: -0.017632175 hartree
energy: -2049.171141810550
dipole: -18.70967 18.35460 -0.35507 5.26012 -5.76351 -0.50338 -28.28586 27.33636 -0.94950
magnitude: 1.13182 au
magnitude: 2.87686 debye
