program: Orca
programVersion: 5.0.2
elementType: Cl Cl F F F F O O C C C C C C C C C C C C C C C H H H H H H H H H H H H
charge: 0
multiplicity: 1
keywords: wb97x-d3
keywords: def2-TZVPP
keywords: def2/J RIJCOSX
keywords: DEFGRID2
keywords: scfconv7
keywords: smallprint printgap noloewdin
keywords: NOSOSCF
formula: C15H12Cl2F4O2
InChI: InChI=1/C15H12Cl2F4O2/c1-15(2)7(3-10(16)17)11(15)14(22)23-5-6-12(20)8(18)4-9(19)13(6)21/h3-4,7,11H,5H2,1-2H3
35 atoms
Cl -2.786465 1.312174 2.112902
Cl -5.466496 1.539527 1.068598
F  2.689397 2.487097 -0.830502
F  2.527798 -2.191066 -0.391916
F  4.081669 -2.037187 1.789969
F  4.26232 2.630987 1.325541
O  0.375737 -0.255957 -1.425974
O  -0.310331 -0.49905 -3.532949
C  -2.159206 -1.993994 -0.858094
C  -1.880128 -0.844173 -1.80328
C  -2.289007 -0.577326 -0.368296
C  -1.030927 -2.82462 -0.297138
C  -3.396178 -2.807031 -1.153309
C  -3.597757 0.04177 -0.126248
C  -0.54295 -0.523743 -2.347753
C  -3.897934 0.850272 0.882132
C  1.701343 0.021757 -1.889671
C  2.571535 0.139092 -0.676696
C  3.025235 1.359923 -0.204507
C  2.946243 -0.996359 0.026331
C  3.747738 -0.918442 1.14783
C  3.837039 1.437286 0.913585
C  4.202916 0.301836 1.602616
H  -2.650558 -0.689892 -2.55093
H  -1.492488 -0.25648 0.29237
H  -0.647484 -3.521602 -1.044728
H  -0.199802 -2.229571 0.072071
H  -1.399289 -3.415904 0.543233
H  -3.814121 -3.217859 -0.232311
H  -4.178527 -2.23468 -1.650036
H  -3.146099 -3.646095 -1.805223
H  -4.39212 -0.162182 -0.834436
H  1.711927 0.941469 -2.473869
H  2.057838 -0.781202 -2.53683
H  4.83361 0.366685 2.480286
elementType: Cl F O C H
totalener: -2049.16757920 hartree
nucrepener: 2242.03723256 hartree
electener: -4291.20481176 hartree
oneelecener: -7279.77861379 hartree
twoeener: 2988.57380203 hartree
cpcmener: -0.02135487 hartree
kineticenergy: 2043.53281244 hartree
xcener: -143.162029673599 hartree
chargesum: -0.0000000
charge: -0.056836 -0.061134 -0.200692 -0.202109 -0.200808 -0.200804 -0.268994 -0.458828 0.086472 -0.088445 0.061231 -0.264040 -0.267407 -0.221447 0.409216 0.044078 0.068617 -0.196403 0.276565 0.247323 0.188449 0.179707 -0.151904 0.095840 0.082054 0.103885 0.082037 0.097890 0.099396 0.090284 0.098532 0.127826 0.119230 0.127171 0.154048
qa: -0.0568 -0.0611 -0.2007 -0.2021 -0.2008 -0.2008 -0.2690 -0.4588 0.0865 -0.0884 0.0612 -0.2640 -0.2674 -0.2214 0.4092 0.0441 0.0686 -0.1964 0.2766 0.2473 0.1884 0.1797 -0.1519 0.0958 0.0821 0.1039 0.0820 0.0979 0.0994 0.0903 0.0985 0.1278 0.1192 0.1272 0.1540
va: 1.2692 1.2437 1.1024 1.0979 1.0897 1.0877 2.1293 2.0469 3.7275 3.8680 3.8212 3.9152 3.9119 3.8929 4.1702 4.2124 3.8099 3.7099 3.8757 3.8571 3.9930 3.9683 3.8559 1.0309 1.0407 0.9994 1.0145 1.0016 1.0010 1.0061 1.0006 1.0202 1.0116 1.0025 0.9983
dispcorr: -0.017241054 hartree
energy: -2049.184820250645
dipole: -13.86914 14.25105 0.38190 -22.33004 21.43715 -0.89289 -15.20567 15.64000 0.43434
magnitude: 1.06383 au
magnitude: 2.70405 debye
