program: Orca
programVersion: 5.0.2
elementType: Cl Cl F F F F O O C C C C C C C C C C C C C C C H H H H H H H H H H H H
charge: 0
multiplicity: 1
keywords: wb97x-d3
keywords: def2-TZVPP
keywords: def2/J RIJCOSX
keywords: DEFGRID2
keywords: scfconv7
keywords: smallprint printgap noloewdin
keywords: NOSOSCF
formula: C15H12Cl2F4O2
InChI: InChI=1/C15H12Cl2F4O2/c1-15(2)7(3-10(16)17)11(15)14(22)23-5-6-12(20)8(18)4-9(19)13(6)21/h3-4,7,11H,5H2,1-2H3
35 atoms
Cl -3.197814 0.95518 2.178916
Cl -5.105821 1.686383 0.143841
F  4.527877 -1.322361 -0.263759
F  1.02252 1.587979 -1.456736
F  1.81203 3.296812 0.429757
F  5.3438 0.422101 1.577564
O  0.855989 -1.089433 -1.972829
O  0.816539 -1.743045 0.158494
C  -2.140572 -2.551709 -0.441219
C  -1.228099 -1.534246 -1.086611
C  -2.16018 -1.133077 0.048987
C  -1.607653 -3.606584 0.49701
C  -3.265214 -3.060826 -1.311561
C  -3.272166 -0.2234 -0.248689
C  0.229975 -1.486281 -0.863279
C  -3.77775 0.679544 0.582474
C  2.269618 -0.934332 -1.92737
C  2.732687 0.064818 -0.900585
C  3.842616 -0.187644 -0.110168
C  2.080976 1.272835 -0.708035
C  2.495729 2.165511 0.260937
C  4.271027 0.71674 0.842307
C  3.597851 1.901275 1.04582
H  -1.533108 -1.211068 -2.075504
H  -1.66745 -0.980789 1.002639
H  -1.138473 -4.421294 -0.057697
H  -0.884403 -3.2255 1.213657
H  -2.436864 -4.032441 1.065171
H  -2.943989 -3.952078 -1.853279
H  -4.128334 -3.336741 -0.702783
H  -3.597836 -2.336419 -2.053495
H  -3.728923 -0.286477 -1.22929
H  2.544688 -0.598405 -2.926669
H  2.74528 -1.901481 -1.766268
H  3.925625 2.605776 1.799594
elementType: Cl F O C H
totalener: -2049.16609701 hartree
nucrepener: 2269.16504589 hartree
electener: -4318.33114291 hartree
oneelecener: -7335.21458239 hartree
twoeener: 3016.88343949 hartree
cpcmener: -0.02087696 hartree
kineticenergy: 2043.55260082 hartree
xcener: -143.168011732282 hartree
chargesum: 0.0000000
charge: -0.055276 -0.060435 -0.203786 -0.201279 -0.202444 -0.202956 -0.282519 -0.452309 0.092818 -0.066731 0.022491 -0.269363 -0.266604 -0.197488 0.387078 0.039206 0.072817 -0.099082 0.231175 0.200247 0.193754 0.198253 -0.174375 0.092714 0.084375 0.098990 0.094757 0.096167 0.099074 0.100944 0.090380 0.127889 0.133744 0.124932 0.152839
qa: -0.0553 -0.0604 -0.2038 -0.2013 -0.2024 -0.2030 -0.2825 -0.4523 0.0928 -0.0667 0.0225 -0.2694 -0.2666 -0.1975 0.3871 0.0392 0.0728 -0.0991 0.2312 0.2002 0.1938 0.1983 -0.1744 0.0927 0.0844 0.0990 0.0948 0.0962 0.0991 0.1009 0.0904 0.1279 0.1337 0.1249 0.1528
va: 1.2708 1.2443 1.0951 1.0962 1.0874 1.0855 2.1238 2.0527 3.7318 3.8431 3.8813 3.8975 3.9091 3.8969 4.1611 4.2128 3.8421 3.5505 3.9143 3.9376 3.9689 3.9566 3.8686 1.0349 1.0440 0.9997 1.0216 0.9998 1.0011 1.0010 1.0060 1.0195 0.9917 1.0142 0.9989
dispcorr: -0.017099554 hartree
energy: -2049.183196568748
dipole: -12.78037 12.72387 -0.05649 -29.55925 28.81416 -0.74509 -10.51522 9.10538 -1.40984
magnitude: 1.59562 au
magnitude: 4.05575 debye
