program: Orca
programVersion: 5.0.2
elementType: Cl Cl F F F F O O C C C C C C C C C C C C C C C H H H H H H H H H H H H
charge: 0
multiplicity: 1
keywords: wb97x-d3
keywords: def2-TZVPP
keywords: def2/J RIJCOSX
keywords: DEFGRID2
keywords: scfconv7
keywords: smallprint printgap noloewdin
keywords: NOSOSCF
formula: C15H12Cl2F4O2
InChI: InChI=1/C15H12Cl2F4O2/c1-15(2)7(3-10(16)17)11(15)14(22)23-5-6-12(20)8(18)4-9(19)13(6)21/h3-4,7,11H,5H2,1-2H3
35 atoms
Cl -1.309742 1.718796 0.115449
Cl -3.787319 2.895238 -0.782057
F  1.257945 0.38075 1.757661
F  3.735761 -1.693264 -1.663593
F  5.06005 0.584255 -2.078188
F  2.575288 2.666541 1.32067
O  0.352409 -1.812172 -0.153893
O  -0.543988 -2.116261 1.880237
C  -3.261823 -2.159705 0.333717
C  -1.92596 -1.503141 0.02569
C  -2.994456 -0.774405 0.813201
C  -3.366355 -3.276431 1.342387
C  -4.163341 -2.352085 -0.861819
C  -3.650477 0.409905 0.216635
C  -0.667117 -1.849925 0.710586
C  -3.003646 1.520712 -0.105742
C  1.689249 -1.991246 0.316789
C  2.459596 -0.726498 0.067184
C  2.192442 0.416574 0.807252
C  3.43634 -0.634095 -0.910963
C  4.123992 0.54678 -1.130093
C  2.871787 1.596976 0.583039
C  3.848562 1.674424 -0.388407
H  -1.802149 -1.191877 -1.005182
H  -2.787705 -0.683333 1.877028
H  -3.002388 -4.215927 0.922484
H  -2.816012 -3.081548 2.259422
H  -4.413091 -3.423498 1.614631
H  -5.209661 -2.385822 -0.551456
H  -4.06095 -1.556118 -1.600445
H  -3.938218 -3.295559 -1.362253
H  -4.722363 0.383105 0.055693
H  2.116716 -2.825782 -0.234858
H  1.709796 -2.253657 1.374066
H  4.384723 2.598379 -0.563682
elementType: Cl F O C H
totalener: -2049.16451104 hartree
nucrepener: 2318.65458452 hartree
electener: -4367.81909555 hartree
oneelecener: -7434.17627650 hartree
twoeener: 3066.35718094 hartree
cpcmener: -0.01984947 hartree
kineticenergy: 2043.54577291 hartree
xcener: -143.164345426159 hartree
chargesum: 0.0000000
charge: -0.056009 -0.057445 -0.197906 -0.202126 -0.201885 -0.201129 -0.277591 -0.456518 0.135092 -0.142825 -0.028217 -0.275641 -0.278669 -0.232693 0.400759 0.092990 0.073238 -0.125817 0.217510 0.227215 0.195467 0.207439 -0.161629 0.114224 0.112250 0.099867 0.095092 0.094392 0.100149 0.093460 0.099819 0.140008 0.115295 0.128550 0.153285
qa: -0.0560 -0.0574 -0.1979 -0.2021 -0.2019 -0.2011 -0.2776 -0.4565 0.1351 -0.1428 -0.0282 -0.2756 -0.2787 -0.2327 0.4008 0.0930 0.0732 -0.1258 0.2175 0.2272 0.1955 0.2074 -0.1616 0.1142 0.1122 0.0999 0.0951 0.0944 0.1001 0.0935 0.0998 0.1400 0.1153 0.1286 0.1533
va: 1.2910 1.2482 1.1010 1.0995 1.0868 1.0887 2.1168 2.0502 3.7059 3.8399 3.8689 3.8919 3.9153 3.9182 4.1672 4.1759 3.8116 3.6349 3.8430 3.9242 3.9559 3.9793 3.8635 1.0259 1.0230 0.9987 1.0198 1.0015 1.0000 0.9988 1.0027 1.0091 1.0090 1.0213 0.9985
dispcorr: -0.018512145 hartree
energy: -2049.183023181809
dipole: -27.91924 27.45492 -0.46432 -28.70348 28.05208 -0.65140 3.93652 -4.59702 -0.66050
magnitude: 1.03739 au
magnitude: 2.63683 debye
