program: Orca
programVersion: 5.0.2
elementType: Cl Cl F F F F O O C C C C C C C C C C C C C C C H H H H H H H H H H H H
charge: 0
multiplicity: 1
keywords: wb97x-d3
keywords: def2-TZVPP
keywords: def2/J RIJCOSX
keywords: DEFGRID2
keywords: scfconv7
keywords: smallprint printgap noloewdin
keywords: NOSOSCF
formula: C15H12Cl2F4O2
InChI: InChI=1/C15H12Cl2F4O2/c1-15(2)7(3-10(16)17)11(15)14(22)23-5-6-12(20)8(18)4-9(19)13(6)21/h3-4,7,11H,5H2,1-2H3
35 atoms
Cl -1.667226 -0.472382 1.833243
Cl -4.368564 0.144891 2.650364
F  3.841433 1.644009 -1.931196
F  1.330577 -1.192451 0.854846
F  2.578871 -0.183971 3.001595
F  5.10562 2.620036 0.207378
O  0.432684 -0.020515 -1.66274
O  -0.243593 -2.150163 -1.845799
C  -3.049129 -0.825801 -2.282031
C  -1.836959 -0.410415 -1.459359
C  -2.910817 -1.301847 -0.876647
C  -2.917287 -1.814657 -3.412604
C  -4.031363 0.28297 -2.574427
C  -3.778395 -0.78983 0.207667
C  -0.495015 -0.982075 -1.67934
C  -3.329881 -0.419379 1.398339
C  1.81219 -0.373004 -1.775243
C  2.543719 0.199105 -0.597035
C  3.515575 1.176823 -0.725615
C  2.252058 -0.243268 0.685109
C  2.898805 0.270526 1.790638
C  4.172675 1.684227 0.382007
C  3.870222 1.240646 1.650472
H  -1.839424 0.624332 -1.136454
H  -2.619197 -2.343317 -0.763131
H  -3.904546 -2.196965 -3.678951
H  -2.501747 -1.335041 -4.301036
H  -2.29333 -2.670884 -3.168151
H  -3.741647 0.824868 -3.476439
H  -5.029615 -0.126361 -2.743324
H  -4.10184 1.008895 -1.763397
H  -4.847104 -0.737904 0.030945
H  2.184903 0.039412 -2.710998
H  1.945784 -1.453925 -1.817425
H  4.381999 1.643164 2.515357
elementType: Cl F O C H
totalener: -2049.16519446 hartree
nucrepener: 2295.55720620 hartree
electener: -4344.72240066 hartree
oneelecener: -7387.93748799 hartree
twoeener: 3043.21508733 hartree
cpcmener: -0.01945009 hartree
kineticenergy: 2043.54239785 hartree
xcener: -143.164130716644 hartree
chargesum: -0.0000000
charge: -0.053632 -0.058911 -0.202256 -0.202207 -0.201010 -0.201834 -0.278703 -0.457707 0.130932 -0.143778 -0.025946 -0.273911 -0.279053 -0.228906 0.405265 0.087132 0.073728 -0.124860 0.227589 0.233515 0.197729 0.200379 -0.168170 0.114730 0.109484 0.094895 0.099735 0.094956 0.099964 0.100928 0.093892 0.138448 0.114276 0.129395 0.153911
qa: -0.0536 -0.0589 -0.2023 -0.2022 -0.2010 -0.2018 -0.2787 -0.4577 0.1309 -0.1438 -0.0259 -0.2739 -0.2791 -0.2289 0.4053 0.0871 0.0737 -0.1249 0.2276 0.2335 0.1977 0.2004 -0.1682 0.1147 0.1095 0.0949 0.0997 0.0950 0.1000 0.1009 0.0939 0.1384 0.1143 0.1294 0.1539
va: 1.2913 1.2465 1.0987 1.0998 1.0887 1.0870 2.1181 2.0508 3.7064 3.8298 3.8675 3.8941 3.9150 3.9101 4.1704 4.1806 3.8125 3.6327 3.9142 3.8612 3.9908 3.9583 3.8646 1.0251 1.0256 1.0015 0.9985 1.0192 1.0026 0.9997 0.9983 1.0099 1.0094 1.0207 0.9984
dispcorr: -0.018035899 hartree
energy: -2049.183230363178
dipole: -24.72924 24.32108 -0.40817 -8.23361 8.86968 0.63607 -29.75245 28.91857 -0.83388
magnitude: 1.12541 au
magnitude: 2.86056 debye
