program: Gaussian 09
title: 000063961
version: EM64L-G09RevD.01
frameworkgroup: C1[X(C19H14Br2N4O2)]
method: RPBEPBE
basis: SDD
operation: Freq
keyword: #p
keyword: freq=noraman
keyword: PBEPBE/SDD
title: #p freq=noraman PBEPBE/SDD
converged: YES YES NO NO
title: Mulliken charges:
elementType: Br Br O O N N N N C C C C C C C C C C C C C C C C C C C H H H H H H H H H H H H H H
charge: 0.054073 0.037802 -0.222231 -0.252392 -0.216533 -0.020882 -0.133653 -0.115123 -0.500059 0.169928 0.169065 0.178447 0.217310 0.252283 -0.270402 -0.663491 -0.782393 0.243472 -0.380660 0.448713 -0.249027 -0.141017 -0.406624 -0.347914 -0.220499 -0.228865 -0.237309 0.290934 0.270458 0.291813 0.252595 0.252911 0.287860 0.232261 0.280089 0.276535 0.235230 0.252796 0.230085 0.231740 0.232672
chargesum: 0.00000
title: Mulliken charges with hydrogens summed into heavy atoms:
elementType: Br Br O O N N N N C C C C C C C C C C C C C C C C C C C
charge: 0.054073 0.037802 -0.222231 -0.252392 -0.216533 -0.020882 -0.133653 -0.115123 0.061333 0.169928 0.169065 0.178447 0.217310 0.252283 0.021411 -0.157985 0.017816 0.243472 -0.380660 0.448713 -0.249027 0.135519 -0.171394 -0.095118 0.009586 0.002875 -0.004636
polarizability: 3.04774981e+02 -6.30334134e+01 2.83335563e+02 -2.31088501e+01 -1.91627598e+01 2.26838185e+02
1716.lowfreq: -7.6584 -4.3150 -2.1557 0.0004 0.0005 0.0007 2.2956 7.5538 10.5916
frequency: -6.1035 6.4531 10.5813 26.1252 35.2731 49.0797 64.7910 84.0880 110.0407 112.5918 116.1500 165.4547 172.9687 176.1045 185.3754 206.0071 217.2533 236.0387 261.2624 292.2236 300.0773 328.1973 347.4939 362.3309 370.3933 382.6438 395.1251 401.9757 464.0268 482.8547 506.4597 510.5851 555.2003 564.3961 568.8491 612.4247 617.9979 623.8498 632.1496 652.3806 698.6581 701.2548 707.0792 723.8414 741.3284 766.9998 782.1470 803.5370 809.8200 843.2662 848.5101 852.5257 871.1564 889.2976 894.5211 901.6011 925.9341 926.7179 951.7333 977.7625 989.2828 990.8084 998.5617 1007.8490 1027.4430 1049.0753 1055.4461 1076.4947 1081.0962 1106.0572 1135.7675 1169.7979 1175.0073 1185.1356 1191.4748 1203.4000 1210.9527 1251.0934 1260.5414 1297.4422 1304.5416 1320.3385 1333.8230 1369.1652 1378.3930 1383.5757 1397.3678 1404.4053 1420.9355 1433.7576 1440.9067 1449.4206 1460.5283 1474.6628 1484.3200 1488.4777 1515.3577 1527.9844 1562.2350 1583.7288 1596.3937 1609.6559 1613.1819 2982.9699 3004.9963 3039.4548 3063.5227 3087.8186 3121.1370 3123.0012 3127.4489 3136.2626 3139.3021 3150.0440 3166.4780 3175.1027 3180.1452
redmass: 6.3917 4.4622 8.2681 7.1624 7.6471 8.6059 7.1800 8.1134 10.3027 17.0317 9.0354 6.4337 4.0093 2.6473 5.0056 1.3977 8.2173 8.8784 7.8825 7.8326 5.5786 4.2282 2.5679 4.5293 6.6515 4.5913 2.2472 2.8045 3.4825 5.8108 6.4204 7.2402 4.1796 5.9443 7.2055 5.6237 5.0104 5.2064 4.6978 7.8266 3.2673 9.1036 3.3004 2.5152 5.1587 5.3946 3.7578 6.4868 3.7006 5.5014 3.1679 1.2587 5.9694 1.4372 4.5678 5.2009 1.7681 1.4429 2.7897 1.3946 5.2807 5.5877 1.3275 2.3756 2.2787 1.7203 2.3520 1.9555 1.8093 2.3450 5.5573 1.8559 1.1018 3.0811 1.2046 2.2721 2.0471 1.9020 3.0125 1.4375 3.9285 1.4888 1.2669 2.3817 4.2713 7.8470 3.1714 1.3344 3.1106 1.1057 2.0353 1.1456 1.1477 1.0531 2.3766 6.6858 8.5179 8.9665 6.4107 8.2289 6.0817 10.6705 6.0696 1.0410 1.0642 1.0630 1.0962 1.0969 1.0998 1.0865 1.0874 1.0974 1.0920 1.0965 1.1017 1.0930 1.0933
irintensity: 0.4194 0.1884 0.0933 0.4026 0.4779 3.4012 3.0455 0.4360 1.4102 0.0713 0.5987 0.4252 2.0659 3.9725 1.4690 1.3133 0.6315 3.4421 0.5240 0.5472 0.4605 1.0606 4.1532 3.2968 1.6100 1.3952 11.7827 0.0621 6.7657 8.4055 5.8622 6.5936 7.5814 3.9471 1.7843 2.2223 6.8160 13.4792 9.3906 6.9011 36.0089 0.4855 5.4751 160.4185 15.5839 9.1630 4.1105 35.2992 5.7248 16.2634 0.9070 0.5155 26.9360 17.0567 7.9883 20.9453 11.1933 7.2227 11.1150 0.3060 16.1161 9.9817 0.2821 6.7872 5.7517 5.7796 1.9595 5.0847 2.5138 8.7200 32.8202 22.5198 3.7539 18.1810 0.8158 1.2242 21.0342 10.8332 2.2635 3.1698 94.1625 23.2835 0.4719 45.1124 47.9577 0.6190 14.0467 93.4952 71.7386 75.5202 9.7493 23.6858 25.3800 16.0605 27.3881 27.1456 31.6525 52.7349 247.7969 44.0710 1.4084 298.0107 3.8125 7.5956 10.2233 19.0595 5.7099 2.2339 4.1796 4.2859 0.2139 2.1780 10.9066 31.2175 16.3490 4.2006 0.1193
temp: 298.150 k
press: 1.00000 atm
elementType: 35 35 8 8 7 7 7 7 6 6 6 6 6 6 6 6 6 6 6 6 6 6 6 6 6 6 6 1 1 1 1 1 1 1 1 1 1 1 1 1 1
symmnumber: 1
zpe: 767634.9 jmol-1
zpe.correction: 0.292377 hartree
zpe.thermalcorrener: 0.315343 hartree
zpe.thermalcorrenthalpy: 0.316287 hartree
zpe.thermalcorrgfe: 0.234525 hartree
zpe.sumelectzpe: -1126.897916 hartree
zpe.sumelectthermal: -1126.874950 hartree
zpe.sumelectthermalent: -1126.874005 hartree
zpe.sumelectthermalfe: -1126.955767 hartree
dipole: 1.1152 0.7325 -0.6370
dipole: 1.4785
quadrupole: -175.0274 -171.1450 -172.3564
quadrupole: 7.4723 -2.2864 12.9919
quadrupole: -2.1845 1.6980 0.4865 7.4723 -2.2864 12.9919
hfenergy: -1127.1902923 hartree
pointgroup: C01 [X(C19H14Br2N4O2)]
dipole: -0.4347638 0.2131387 0.3223303 debye
polarizability: 313.9227803|62.4678562|254.445756|4.8930848|34.835174|246.5801926 unknown
InChI: InChI=1S/C19H14Br2N4O2/c1-11-22-18-14(8-13(20)9-15(18)21)19(26)25(11)10-17-24-23-16(27-17)7-12-5-3-2-4-6-12/h2-6,8-9H,7,10H2,1H3
charge 0 multiplicity 1
41 atoms
Br 4.701497 -1.249362 -2.67431
Br 5.363256 1.966984 2.084441
O  -2.414214 -0.594204 0.866826
O  0.573256 -0.886621 2.487061
N  0.374388 -2.144107 0.511446
N  2.05803 -2.114627 -1.202744
N  -2.92528 -2.294221 -0.557708
N  -3.863549 -1.213364 -0.781382
C  -0.944789 -2.629094 1.008723
C  0.904824 -2.566035 -0.729101
C  2.341206 -0.723415 0.827643
C  1.06212 -1.219144 1.367483
C  2.787005 -1.188345 -0.453024
C  -2.099698 -1.891834 0.406036
C  3.091135 0.206614 1.590232
C  -4.14067 1.115359 0.237248
C  0.140821 -3.587847 -1.533961
C  -3.529349 -0.23796 0.06276
C  4.027078 -0.67144 -0.942975
C  -3.220548 2.253491 -0.221584
C  4.297844 0.680681 1.065436
C  4.778684 0.25198 -0.199391
C  -3.532288 2.992427 -1.388525
C  -2.051861 2.579891 0.512769
C  -2.692194 4.046639 -1.815658
C  -1.212458 3.632472 0.086011
C  -1.530229 4.369611 -1.078928
H  -0.937152 -2.474324 2.10159
H  -1.058287 -3.699561 0.785736
H  2.704213 0.524063 2.562207
H  -4.405608 1.24873 1.303322
H  -5.077665 1.119151 -0.343584
H  -0.906068 -3.289228 -1.720508
H  0.119503 -4.568923 -1.021066
H  0.663046 -3.712501 -2.492598
H  5.723788 0.634918 -0.591894
H  -4.430433 2.743025 -1.966365
H  -1.794022 2.008489 1.412356
H  -2.944494 4.611567 -2.719853
H  -0.312506 3.876706 0.661279
H  -0.878228 5.185959 -1.408748
