program: Orca
programVersion: 5.0.2
elementType: Cl Cl F F F F O O C C C C C C C C C C C C C C C H H H H H H H H H H H H
charge: 0
multiplicity: 1
keywords: wb97x-d3
keywords: def2-TZVPP
keywords: def2/J RIJCOSX
keywords: DEFGRID2
keywords: scfconv7
keywords: smallprint printgap noloewdin
keywords: NOSOSCF
formula: C15H12Cl2F4O2
InChI: InChI=1/C15H12Cl2F4O2/c1-15(2)7(3-10(16)17)11(15)14(22)23-5-6-12(20)8(18)4-9(19)13(6)21/h3-4,7,11H,5H2,1-2H3
35 atoms
Cl -1.400398 0.227731 1.736519
Cl -4.066815 -0.328416 2.701773
F  3.385845 1.817087 -1.661924
F  1.376122 -1.872533 0.463726
F  2.27984 -1.001249 2.822342
F  4.324966 2.651653 0.687171
O  0.360323 -0.666511 -1.896254
O  0.128362 1.55134 -1.889854
C  -2.682868 -0.770795 -2.322756
C  -1.798464 0.217784 -1.576806
C  -2.30754 -1.041383 -0.906311
C  -2.126668 -1.659618 -3.408429
C  -4.075573 -0.269536 -2.621219
C  -3.272756 -0.932717 0.209989
C  -0.361103 0.450198 -1.811245
C  -2.95751 -0.417542 1.389853
C  1.777504 -0.539021 -1.971867
C  2.341905 -0.049472 -0.668076
C  3.102504 1.104211 -0.572187
C  2.087589 -0.745655 0.504903
C  2.562716 -0.302264 1.723082
C  3.592214 1.538206 0.646574
C  3.32486 0.844858 1.807012
H  -2.302404 1.136625 -1.298553
H  -1.561912 -1.819012 -0.764112
H  -2.839708 -2.457613 -3.624419
H  -1.972753 -1.099226 -4.332452
H  -1.185744 -2.133084 -3.139189
H  -4.453534 0.40606 -1.85296
H  -4.093166 0.270022 -3.569783
H  -4.77426 -1.10457 -2.704062
H  -4.275168 -1.324512 0.07633
H  2.069705 0.102823 -2.801901
H  2.140617 -1.541933 -2.191683
H  3.704329 1.191112 2.75987
elementType: Cl F O C H
totalener: -2049.16398792 hartree
nucrepener: 2362.59714351 hartree
electener: -4411.76113144 hartree
oneelecener: -7522.13367513 hartree
twoeener: 3110.37254369 hartree
cpcmener: -0.02186068 hartree
kineticenergy: 2043.54533146 hartree
xcener: -143.165495872350 hartree
chargesum: 0.0000000
charge: -0.056495 -0.056413 -0.202067 -0.199267 -0.202216 -0.202360 -0.269103 -0.452538 0.137692 -0.132688 -0.012068 -0.271358 -0.284128 -0.243125 0.393478 0.091495 0.056644 -0.122231 0.264736 0.171772 0.204552 0.194734 -0.167249 0.110302 0.113182 0.094084 0.101863 0.094432 0.093407 0.100190 0.100920 0.139915 0.123194 0.133078 0.153637
qa: -0.0565 -0.0564 -0.2021 -0.1993 -0.2022 -0.2024 -0.2691 -0.4525 0.1377 -0.1327 -0.0121 -0.2714 -0.2841 -0.2431 0.3935 0.0915 0.0566 -0.1222 0.2647 0.1718 0.2046 0.1947 -0.1672 0.1103 0.1132 0.0941 0.1019 0.0944 0.0934 0.1002 0.1009 0.1399 0.1232 0.1331 0.1536
va: 1.2828 1.2500 1.0970 1.0946 1.0854 1.0865 2.1058 2.0594 3.7161 3.8523 3.8336 3.8948 3.9183 3.9089 4.1543 4.1712 3.8505 3.5668 3.8868 3.9138 3.9414 3.9576 3.8724 1.0221 1.0215 1.0011 0.9994 1.0136 0.9998 1.0023 0.9995 1.0088 1.0165 0.9970 0.9983
dispcorr: -0.019772943 hartree
energy: -2049.183760867536
dipole: -21.53140 20.99686 -0.53454 -9.20560 7.68403 -1.52157 -30.17488 29.27859 -0.89628
magnitude: 1.84505 au
magnitude: 4.68975 debye
