program: Orca
programVersion: 5.0.2
elementType: Cl Cl F F F F O O C C C C C C C C C C C C C C C H H H H H H H H H H H H
charge: 0
multiplicity: 1
keywords: wb97x-d3
keywords: def2-TZVPP
keywords: def2/J RIJCOSX
keywords: DEFGRID2
keywords: scfconv7
keywords: smallprint printgap noloewdin
keywords: NOSOSCF
formula: C15H12Cl2F4O2
InChI: InChI=1/C15H12Cl2F4O2/c1-15(2)7(3-10(16)17)11(15)14(22)23-5-6-12(20)8(18)4-9(19)13(6)21/h3-4,7,11H,5H2,1-2H3
35 atoms
Cl -4.238588 -1.242519 2.105803
Cl -5.183306 1.451212 1.68947
F  4.439741 0.570346 -2.223419
F  1.539554 -0.440242 1.337453
F  2.926421 1.214124 2.93161
F  5.826799 2.199801 -0.624085
O  0.842122 -0.416041 -1.509511
O  -0.109178 -2.273272 -0.685657
C  -2.634126 -1.063497 -2.104843
C  -1.461628 -0.427117 -1.385135
C  -2.71372 -0.825279 -0.62459
C  -2.567655 -2.494049 -2.58069
C  -3.386208 -0.165745 -3.057814
C  -3.550917 0.233031 -0.048242
C  -0.203748 -1.160486 -1.13949
C  -4.228768 0.14731 1.08953
C  2.165669 -0.928118 -1.350206
C  2.951625 0.011799 -0.483701
C  4.050847 0.709798 -0.955572
C  2.594131 0.208083 0.842627
C  3.306448 1.059204 1.663784
C  4.769873 1.556845 -0.130055
C  4.405231 1.74264 1.185081
H  -1.333999 0.632469 -1.576326
H  -2.606584 -1.719511 -0.021217
H  -2.146107 -3.175509 -1.845755
H  -3.575202 -2.84609 -2.809482
H  -1.977147 -2.574025 -3.495471
H  -3.347032 0.88703 -2.780239
H  -2.965194 -0.250715 -4.061304
H  -4.436236 -0.459422 -3.114165
H  -3.623753 1.171481 -0.584857
H  2.605008 -1.007383 -2.342522
H  2.157214 -1.927808 -0.915913
H  4.96801 2.407806 1.827839
elementType: Cl F O C H
totalener: -2049.16774469 hartree
nucrepener: 2201.35983675 hartree
electener: -4250.52758144 hartree
oneelecener: -7199.15331537 hartree
twoeener: 2948.62573393 hartree
cpcmener: -0.02075869 hartree
kineticenergy: 2043.53074668 hartree
xcener: -143.162884092426 hartree
chargesum: -0.0000000
charge: -0.055598 -0.061415 -0.202319 -0.200753 -0.200963 -0.201418 -0.282061 -0.456531 0.086510 -0.094482 0.030624 -0.270068 -0.267212 -0.202404 0.417180 0.042903 0.069301 -0.136354 0.227715 0.244274 0.193577 0.199526 -0.165073 0.095135 0.079059 0.095547 0.097405 0.100191 0.091514 0.097967 0.100943 0.127960 0.116011 0.129954 0.153356
qa: -0.0556 -0.0614 -0.2023 -0.2008 -0.2010 -0.2014 -0.2821 -0.4565 0.0865 -0.0945 0.0306 -0.2701 -0.2672 -0.2024 0.4172 0.0429 0.0693 -0.1364 0.2277 0.2443 0.1936 0.1995 -0.1651 0.0951 0.0791 0.0955 0.0974 0.1002 0.0915 0.0980 0.1009 0.1280 0.1160 0.1300 0.1534
va: 1.2700 1.2432 1.0983 1.1013 1.0885 1.0875 2.1224 2.0571 3.7328 3.8323 3.8622 3.9073 3.9102 3.9021 4.1906 4.2119 3.8148 3.6345 3.9066 3.8716 3.9862 3.9610 3.8649 1.0347 1.0487 1.0190 1.0004 0.9989 1.0055 1.0012 1.0007 1.0197 1.0100 1.0205 0.9987
dispcorr: -0.016201328 hartree
energy: -2049.183946022039
dipole: -16.04564 16.55290 0.50726 -11.99662 12.71376 0.71714 -26.76084 25.33931 -1.42152
magnitude: 1.67103 au
magnitude: 4.24741 debye
