program: Orca
programVersion: 5.0.2
elementType: Cl Cl F F F F O O C C C C C C C C C C C C C C C H H H H H H H H H H H H
charge: 0
multiplicity: 1
keywords: wb97x-d3
keywords: def2-TZVPP
keywords: def2/J RIJCOSX
keywords: DEFGRID2
keywords: scfconv7
keywords: smallprint printgap noloewdin
keywords: NOSOSCF
formula: C15H12Cl2F4O2
InChI: InChI=1/C15H12Cl2F4O2/c1-15(2)7(3-10(16)17)11(15)14(22)23-5-6-12(20)8(18)4-9(19)13(6)21/h3-4,7,11H,5H2,1-2H3
35 atoms
Cl -5.466415 0.998443 1.034036
Cl -6.362602 0.162302 -1.576596
F  4.248413 2.540193 -1.050521
F  1.960565 -1.083975 0.915502
F  4.246265 -2.415011 1.102743
F  6.545465 1.204817 -0.803366
O  0.658388 0.743181 -0.604276
O  -0.381902 0.995735 1.366321
C  -1.878527 -1.594409 0.400226
C  -1.346608 -0.378934 -0.335194
C  -2.751251 -0.384013 0.237764
C  -1.409764 -1.932314 1.793885
C  -2.122273 -2.819168 -0.448408
C  -3.893428 -0.365424 -0.683411
C  -0.336666 0.517654 0.26104
C  -5.07404 0.186751 -0.432692
C  1.749209 1.567004 -0.210269
C  3.020223 0.768556 -0.100108
C  4.224628 1.315003 -0.520688
C  3.069345 -0.500778 0.457214
C  4.260221 -1.194248 0.568292
C  5.41696 0.627017 -0.393875
C  5.449106 -0.639893 0.146727
H  -1.263507 -0.501904 -1.409142
H  -2.868335 0.204944 1.140455
H  -1.306764 -1.062824 2.439176
H  -2.132743 -2.602608 2.263859
H  -0.451102 -2.453475 1.768879
H  -2.928026 -3.423769 -0.02708
H  -2.385177 -2.582777 -1.479278
H  -1.224214 -3.439246 -0.47716
H  -3.773927 -0.838312 -1.650973
H  1.546499 2.076286 0.732924
H  1.849575 2.331133 -0.979516
H  6.381386 -1.181635 0.241561
elementType: Cl F O C H
totalener: -2049.16634346 hartree
nucrepener: 2195.16190959 hartree
electener: -4244.32825305 hartree
oneelecener: -7186.60724064 hartree
twoeener: 2942.27898759 hartree
cpcmener: -0.01984907 hartree
kineticenergy: 2043.52467986 hartree
xcener: -143.163097294364 hartree
chargesum: 0.0000000
charge: -0.056165 -0.061081 -0.203844 -0.202540 -0.201602 -0.201482 -0.286371 -0.450235 0.091345 -0.075512 0.026260 -0.269365 -0.262854 -0.202960 0.385275 0.042092 0.083323 -0.093675 0.208916 0.220241 0.202641 0.201294 -0.172039 0.094436 0.079244 0.097735 0.100437 0.092722 0.100939 0.090049 0.098344 0.129158 0.120470 0.121626 0.153177
qa: -0.0562 -0.0611 -0.2038 -0.2025 -0.2016 -0.2015 -0.2864 -0.4502 0.0913 -0.0755 0.0263 -0.2694 -0.2629 -0.2030 0.3853 0.0421 0.0833 -0.0937 0.2089 0.2202 0.2026 0.2013 -0.1720 0.0944 0.0792 0.0977 0.1004 0.0927 0.1009 0.0900 0.0983 0.1292 0.1205 0.1216 0.1532
va: 1.2694 1.2439 1.0945 1.0938 1.0876 1.0875 2.1184 2.0560 3.7291 3.8370 3.8759 3.8981 3.9053 3.9027 4.2118 4.2107 3.8433 3.6120 3.9199 3.8614 3.9999 3.9651 3.8687 1.0336 1.0512 1.0179 1.0012 1.0070 1.0012 1.0056 1.0017 1.0186 1.0211 1.0051 0.9987
dispcorr: -0.016735452 hartree
energy: -2049.183078911536
dipole: -7.89828 8.94499 1.04670 -14.42887 13.53385 -0.89502 2.89271 -3.75277 -0.86007
magnitude: 1.62369 au
magnitude: 4.12708 debye
