program: Orca
programVersion: 5.0.2
elementType: Cl Cl F F F F O O C C C C C C C C C C C C C C C H H H H H H H H H H H H
charge: 0
multiplicity: 1
keywords: wb97x-d3
keywords: def2-TZVPP
keywords: def2/J RIJCOSX
keywords: DEFGRID2
keywords: scfconv7
keywords: smallprint printgap noloewdin
keywords: NOSOSCF
formula: C15H12Cl2F4O2
InChI: InChI=1/C15H12Cl2F4O2/c1-15(2)7(3-10(16)17)11(15)14(22)23-5-6-12(20)8(18)4-9(19)13(6)21/h3-4,7,11H,5H2,1-2H3
35 atoms
Cl -4.229229 2.246158 -0.005981
Cl -6.342444 0.490517 -0.883132
F  1.903098 1.519047 1.088896
F  3.413924 -1.24308 -2.40463
F  5.389033 -2.136861 -0.839358
F  3.893192 0.616415 2.653988
O  0.188079 0.255719 -1.029607
O  0.535173 -1.8202 -1.780361
C  -1.796876 -1.367753 0.829165
C  -1.491352 -1.361004 -0.651866
C  -2.436786 -0.338491 -0.065172
C  -0.766652 -0.889349 1.823085
C  -2.608757 -2.534791 1.338456
C  -3.859815 -0.388841 -0.424665
C  -0.158769 -1.025241 -1.210069
C  -4.690189 0.646949 -0.433867
C  1.45571 0.658001 -1.535565
C  2.589586 0.146917 -0.69196
C  2.748739 0.60757 0.608107
C  3.500017 -0.787559 -1.162862
C  4.528748 -1.245456 -0.355649
C  3.771235 0.147641 1.415113
C  4.669543 -0.785497 0.936922
H  -1.940209 -2.181557 -1.201539
H  -2.030062 0.659512 0.040154
H  -1.249771 -0.658664 2.773787
H  -0.022263 -1.665346 2.012146
H  -0.245478 0.007887 1.49988
H  -3.305914 -2.927436 0.599304
H  -1.949283 -3.354932 1.6260
H  -3.186642 -2.246874 2.218028
H  -4.280461 -1.34311 -0.717338
H  1.431065 1.746308 -1.515164
H  1.574524 0.343672 -2.571662
H  5.47402 -1.145232 1.56378
totalener: -2049.14921416 hartree
nucrepener: 2253.03049728 hartree
electener: -4302.17971143 hartree
oneelecener: -7302.24961957 hartree
twoeener: 3000.06990814 hartree
kineticenergy: 2043.57425671 hartree
xcener: -143.166744659730 hartree
chargesum: 0.0000000
charge: -0.043289 -0.045834 -0.189030 -0.174891 -0.181354 -0.183444 -0.263102 -0.349417 0.071550 -0.098575 0.079021 -0.266137 -0.246275 -0.222224 0.343330 0.052807 0.035226 -0.170149 0.178526 0.299930 0.173854 0.190853 -0.174199 0.082907 0.079010 0.094344 0.096767 0.091143 0.071925 0.096406 0.097313 0.097134 0.122643 0.120922 0.132308
qa: -0.0433 -0.0458 -0.1890 -0.1749 -0.1814 -0.1834 -0.2631 -0.3494 0.0716 -0.0986 0.0790 -0.2661 -0.2463 -0.2222 0.3433 0.0528 0.0352 -0.1701 0.1785 0.2999 0.1739 0.1909 -0.1742 0.0829 0.0790 0.0943 0.0968 0.0911 0.0719 0.0964 0.0973 0.0971 0.1226 0.1209 0.1323
va: 1.2843 1.2600 1.1129 1.1334 1.1144 1.1129 2.1184 2.1565 3.7539 3.8443 3.7619 3.9196 3.9113 3.9269 4.2910 4.2432 3.8846 3.6006 3.8861 3.8699 4.0016 3.9930 3.8774 1.0319 1.0496 1.0050 0.9998 1.0171 1.0105 1.0033 1.0029 1.0300 0.9955 1.0148 1.0076
dispcorr: -0.018180551 hartree
energy: -2049.167394706371
dipole: -8.05751 8.26842 0.21091 -13.63826 13.63628 -0.00198 7.35921 -6.84155 0.51766
magnitude: 0.55898 au
magnitude: 1.42081 debye
