program: Orca
programVersion: 5.0.2
elementType: Cl Cl F F F F O O C C C C C C C C C C C C C C C H H H H H H H H H H H H
charge: 0
multiplicity: 1
keywords: wb97x-d3
keywords: def2-TZVPP
keywords: def2/J RIJCOSX
keywords: DEFGRID2
keywords: scfconv7
keywords: smallprint printgap noloewdin
keywords: NOSOSCF
formula: C15H12Cl2F4O2
InChI: InChI=1/C15H12Cl2F4O2/c1-15(2)7(3-10(16)17)11(15)14(22)23-5-6-12(20)8(18)4-9(19)13(6)21/h3-4,7,11H,5H2,1-2H3
35 atoms
Cl -2.988685 0.678903 2.50433
Cl -4.954106 1.663682 0.636873
F  3.944953 -1.454044 0.380456
F  1.562759 1.73365 -2.120307
F  2.331105 3.651369 -0.394303
F  4.720936 0.464004 2.079969
O  0.850571 -1.082306 -1.930332
O  0.804304 -1.799945 0.185821
C  -2.143893 -2.59725 -0.494454
C  -1.238705 -1.510826 -1.033194
C  -2.143934 -1.247824 0.15927
C  -1.581735 -3.758261 0.289712
C  -3.292862 -2.998705 -1.389626
C  -3.245261 -0.290426 0.00496
C  0.22485 -1.49936 -0.822589
C  -3.664948 0.564152 0.930082
C  2.266603 -0.975202 -1.868277
C  2.723367 0.089108 -0.909428
C  3.531841 -0.208044 0.176604
C  2.330091 1.408664 -1.082803
C  2.725919 2.396098 -0.199479
C  3.936731 0.781839 1.054451
C  3.532589 2.088578 0.876922
H  -1.552995 -1.075314 -1.974876
H  -1.622751 -1.210021 1.108943
H  -1.165081 -4.512419 -0.38043
H  -0.802846 -3.464184 0.98749
H  -2.38281 -4.231125 0.86019
H  -2.988746 -3.814015 -2.047604
H  -4.138401 -3.348631 -0.795427
H  -3.647019 -2.188752 -2.026143
H  -3.760059 -0.254243 -0.947063
H  2.570188 -0.725581 -2.884098
H  2.713198 -1.93557 -1.61183
H  3.844948 2.86022 1.567192
totalener: -2049.15145153 hartree
nucrepener: 2261.60511189 hartree
electener: -4310.75656342 hartree
oneelecener: -7319.77836709 hartree
twoeener: 3009.02180367 hartree
kineticenergy: 2043.58676991 hartree
xcener: -143.170217624978 hartree
chargesum: 0.0000000
charge: -0.039702 -0.046119 -0.185319 -0.182728 -0.183833 -0.183419 -0.263518 -0.383042 0.070708 -0.083856 0.035334 -0.243654 -0.249502 -0.199841 0.352311 0.050563 0.065475 -0.189289 0.301815 0.195824 0.182186 0.179829 -0.174874 0.079709 0.087033 0.084713 0.103761 0.087790 0.092962 0.099550 0.074311 0.095350 0.122279 0.115905 0.131288
qa: -0.0397 -0.0461 -0.1853 -0.1827 -0.1838 -0.1834 -0.2635 -0.3830 0.0707 -0.0839 0.0353 -0.2437 -0.2495 -0.1998 0.3523 0.0506 0.0655 -0.1893 0.3018 0.1958 0.1822 0.1798 -0.1749 0.0797 0.0870 0.0847 0.1038 0.0878 0.0930 0.0995 0.0743 0.0953 0.1223 0.1159 0.1313
va: 1.2879 1.2589 1.1204 1.1210 1.1114 1.1122 2.1323 2.1208 3.7554 3.8415 3.8369 3.9121 3.9123 3.9235 4.2235 4.2526 3.8663 3.6345 3.8309 3.9455 3.9855 3.9998 3.8704 1.0362 1.0496 1.0026 1.0235 1.0008 1.0042 1.0026 1.0097 1.0323 0.9900 1.0189 1.0079
dispcorr: -0.016879166 hartree
energy: -2049.168330695334
dipole: -13.32238 13.25827 -0.06411 -29.72284 29.14342 -0.57942 -12.12847 11.20274 -0.92572
magnitude: 1.09399 au
magnitude: 2.78069 debye
