program: Orca
programVersion: 5.0.2
elementType: Cl Cl F F F F O O C C C C C C C C C C C C C C C H H H H H H H H H H H H
charge: 0
multiplicity: 1
keywords: wb97x-d3
keywords: def2-TZVPP
keywords: def2/J RIJCOSX
keywords: DEFGRID2
keywords: scfconv7
keywords: smallprint printgap noloewdin
keywords: NOSOSCF
formula: C15H12Cl2F4O2
InChI: InChI=1/C15H12Cl2F4O2/c1-15(2)7(3-10(16)17)11(15)14(22)23-5-6-12(20)8(18)4-9(19)13(6)21/h3-4,7,11H,5H2,1-2H3
35 atoms
Cl -1.602878 1.863822 0.302391
Cl -4.113915 2.861448 -0.717496
F  1.121582 0.703616 1.385538
F  4.053199 -2.043343 -1.051467
F  5.536679 0.099582 -1.670001
F  2.587238 2.852125 0.727386
O  0.403105 -1.712607 -0.052193
O  -0.663935 -2.059738 1.891693
C  -3.196493 -2.18559 0.05969
C  -1.891932 -1.414866 -0.055981
C  -3.079841 -0.83086 0.673254
C  -3.31177 -3.388572 0.962789
C  -3.972161 -2.327836 -1.228416
C  -3.793342 0.337256 0.111446
C  -0.688013 -1.766505 0.727688
C  -3.240482 1.528134 -0.075842
C  1.6793 -1.896699 0.54846
C  2.543518 -0.724112 0.18408
C  2.199494 0.54666 0.62269
C  3.678914 -0.84757 -0.599965
C  4.446965 0.258568 -0.925109
C  2.955928 1.652818 0.289272
C  4.089449 1.516097 -0.487506
H  -1.683052 -1.010267 -1.039318
H  -2.972253 -0.820021 1.755307
H  -4.363765 -3.583329 1.178775
H  -2.906214 -4.278229 0.477926
H  -2.795941 -3.257978 1.910227
H  -5.037528 -2.452813 -1.024046
H  -3.858651 -1.464873 -1.885007
H  -3.638308 -3.207934 -1.779612
H  -4.842102 0.229037 -0.140148
H  2.104415 -2.825417 0.170582
H  1.590942 -1.987561 1.63181
H  4.687406 2.379188 -0.746339
totalener: -2049.14934450 hartree
nucrepener: 2298.85517767 hartree
electener: -4348.00452217 hartree
oneelecener: -7394.23190545 hartree
twoeener: 3046.22738329 hartree
kineticenergy: 2043.58867069 hartree
xcener: -143.169076665591 hartree
chargesum: -0.0000000
charge: -0.032292 -0.044728 -0.183844 -0.188057 -0.182101 -0.180726 -0.267482 -0.380996 0.118592 -0.155599 -0.016410 -0.253515 -0.269194 -0.249836 0.375720 0.098387 0.049268 -0.139484 0.229933 0.225128 0.187818 0.184682 -0.171912 0.104832 0.108917 0.084716 0.086545 0.104915 0.092358 0.087998 0.094978 0.116855 0.103353 0.128565 0.132617
qa: -0.0323 -0.0447 -0.1838 -0.1881 -0.1821 -0.1807 -0.2675 -0.3810 0.1186 -0.1556 -0.0164 -0.2535 -0.2692 -0.2498 0.3757 0.0984 0.0493 -0.1395 0.2299 0.2251 0.1878 0.1847 -0.1719 0.1048 0.1089 0.0847 0.0865 0.1049 0.0924 0.0880 0.0950 0.1169 0.1034 0.1286 0.1326
va: 1.3157 1.2609 1.1234 1.1153 1.1130 1.1155 2.1148 2.1222 3.7151 3.8774 3.8438 3.9025 3.9138 3.9089 4.1792 4.2029 3.8535 3.6512 3.8665 3.9082 3.9893 4.0247 3.8682 1.0264 1.0270 1.0022 1.0019 1.0214 1.0015 1.0006 1.0062 1.0174 1.0088 1.0201 1.0075
dispcorr: -0.018045105 hartree
energy: -2049.167389600878
dipole: -26.93973 26.70920 -0.23053 -28.80383 28.30793 -0.49590 1.45062 -1.90861 -0.45800
magnitude: 0.71332 au
magnitude: 1.81311 debye
