program: Orca
programVersion: 5.0.2
elementType: Cl Cl F F F F O O C C C C C C C C C C C C C C C H H H H H H H H H H H H
charge: 0
multiplicity: 1
keywords: wb97x-d3
keywords: def2-TZVPP
keywords: def2/J RIJCOSX
keywords: DEFGRID2
keywords: scfconv7
keywords: smallprint printgap noloewdin
keywords: NOSOSCF
formula: C15H12Cl2F4O2
InChI: InChI=1/C15H12Cl2F4O2/c1-15(2)7(3-10(16)17)11(15)14(22)23-5-6-12(20)8(18)4-9(19)13(6)21/h3-4,7,11H,5H2,1-2H3
35 atoms
Cl -4.705841 0.888704 1.684556
Cl -6.368123 0.531792 -0.645412
F  3.278479 2.194215 -1.161784
F  2.0932 -0.895911 2.178387
F  4.397541 -2.219704 1.761436
F  5.574442 0.879796 -1.559044
O  0.178221 0.631416 0.476673
O  0.682593 0.704095 -1.695768
C  -1.67836 -1.704611 -0.331216
C  -1.286485 -0.429009 -1.045024
C  -2.451107 -0.44174 -0.072447
C  -0.840758 -2.265791 0.792727
C  -2.281055 -2.785392 -1.199047
C  -3.807435 -0.231693 -0.594395
C  -0.04645 0.347045 -0.812096
C  -4.817122 0.321894 0.066233
C  1.331577 1.410084 0.771087
C  2.618524 0.677197 0.513116
C  3.527589 1.108229 -0.441732
C  2.93741 -0.458085 1.244732
C  4.121173 -1.139992 1.034406
C  4.717335 0.430493 -0.646973
C  5.020862 -0.698535 0.085231
H  -1.547904 -0.410001 -2.097191
H  -2.253299 0.016826 0.888641
H  -0.507668 -1.511868 1.4992
H  -1.426117 -2.999841 1.348659
H  0.041202 -2.776724 0.402306
H  -2.984791 -3.389668 -0.624419
H  -2.811529 -2.395865 -2.066902
H  -1.498723 -3.44808 -1.571357
H  -4.014547 -0.542727 -1.610888
H  1.241139 1.647402 1.830105
H  1.309952 2.347069 0.215627
H  5.950308 -1.226841 -0.07817
totalener: -2049.14909168 hartree
nucrepener: 2240.49277023 hartree
electener: -4289.64186191 hartree
oneelecener: -7277.22495384 hartree
twoeener: 2987.58309193 hartree
kineticenergy: 2043.57462883 hartree
xcener: -143.167719429525 hartree
chargesum: 0.0000000
charge: -0.043814 -0.044947 -0.179123 -0.188286 -0.184446 -0.182099 -0.268406 -0.353307 0.080415 -0.107810 0.068864 -0.257519 -0.246784 -0.219105 0.353898 0.052802 0.033333 -0.168842 0.299141 0.196827 0.181869 0.177688 -0.176257 0.082562 0.081527 0.091404 0.091380 0.092085 0.097515 0.073337 0.095615 0.096808 0.121486 0.120850 0.131336
qa: -0.0438 -0.0449 -0.1791 -0.1883 -0.1844 -0.1821 -0.2684 -0.3533 0.0804 -0.1078 0.0689 -0.2575 -0.2468 -0.2191 0.3539 0.0528 0.0333 -0.1688 0.2991 0.1968 0.1819 0.1777 -0.1763 0.0826 0.0815 0.0914 0.0914 0.0921 0.0975 0.0733 0.0956 0.0968 0.1215 0.1208 0.1313
va: 1.2837 1.2606 1.1280 1.1123 1.1108 1.1136 2.1060 2.1558 3.7183 3.8424 3.7792 3.9172 3.9180 3.9240 4.2804 4.2451 3.8832 3.6083 3.8521 3.8854 4.0060 3.9981 3.8771 1.0328 1.0489 1.0205 1.0039 1.0020 1.0027 1.0107 1.0033 1.0313 0.9952 1.0155 1.0078
dispcorr: -0.017878282 hartree
energy: -2049.166969958958
dipole: -7.17085 7.36268 0.19183 -15.44234 14.87308 -0.56926 -4.70015 5.08837 0.38822
magnitude: 0.71524 au
magnitude: 1.81800 debye
