program: Orca
programVersion: 5.0.2
elementType: Cl Cl F F F F O O C C C C C C C C C C C C C C C H H H H H H H H H H H H
charge: 0
multiplicity: 1
keywords: wb97x-d3
keywords: def2-TZVPP
keywords: def2/J RIJCOSX
keywords: DEFGRID2
keywords: scfconv7
keywords: smallprint printgap noloewdin
keywords: NOSOSCF
formula: C15H12Cl2F4O2
InChI: InChI=1/C15H12Cl2F4O2/c1-15(2)7(3-10(16)17)11(15)14(22)23-5-6-12(20)8(18)4-9(19)13(6)21/h3-4,7,11H,5H2,1-2H3
35 atoms
Cl -5.712684 0.544577 0.71341
Cl -6.250367 -0.28443 -1.997215
F  4.146745 2.434012 -1.194478
F  2.077653 -0.972591 1.290815
F  4.27707 -2.501151 1.020378
F  6.352102 0.917774 -1.423914
O  0.723425 0.82349 -0.393948
O  -0.632052 1.314213 1.32415
C  -1.839603 -1.464726 0.451674
C  -1.316989 -0.272226 -0.326616
C  -2.762134 -0.329936 0.107361
C  -1.47207 -1.658431 1.902652
C  -1.936266 -2.765899 -0.308429
C  -3.814835 -0.459942 -0.908809
C  -0.411249 0.708466 0.3122
C  -5.085144 -0.11176 -0.744619
C  1.792489 1.572379 0.172484
C  3.047655 0.759314 0.038382
C  4.160427 1.221188 -0.645037
C  3.117554 -0.506772 0.603315
C  4.249157 -1.288718 0.475882
C  5.30077 0.443289 -0.763879
C  5.351366 -0.817359 -0.209192
H  -1.103908 -0.467002 -1.372094
H  -3.002475 0.319686 0.941247
H  -0.487421 -2.119219 1.993651
H  -1.462966 -0.729926 2.467282
H  -2.194505 -2.326456 2.373941
H  -1.003558 -3.324242 -0.216953
H  -2.736876 -3.386286 0.097067
H  -2.1309 -2.631086 -1.371792
H  -3.548654 -0.866902 -1.876727
H  1.592776 1.802838 1.220114
H  1.880548 2.518083 -0.360845
H  6.240618 -1.425128 -0.305534
totalener: -2049.15126500 hartree
nucrepener: 2192.44699323 hartree
electener: -4241.59825823 hartree
oneelecener: -7180.99946149 hartree
twoeener: 2939.40120326 hartree
kineticenergy: 2043.58235286 hartree
xcener: -143.168746032678 hartree
chargesum: 0.0000000
charge: -0.040161 -0.047090 -0.187008 -0.187571 -0.181824 -0.180988 -0.270790 -0.372104 0.069525 -0.082361 0.044625 -0.249954 -0.239575 -0.203510 0.341252 0.048941 0.042197 -0.134421 0.229209 0.225298 0.187156 0.189087 -0.173420 0.076783 0.087471 0.086597 0.101997 0.091001 0.095214 0.098806 0.070536 0.097748 0.126792 0.107646 0.132898
qa: -0.0402 -0.0471 -0.1870 -0.1876 -0.1818 -0.1810 -0.2708 -0.3721 0.0695 -0.0824 0.0446 -0.2500 -0.2396 -0.2035 0.3413 0.0489 0.0422 -0.1344 0.2292 0.2253 0.1872 0.1891 -0.1734 0.0768 0.0875 0.0866 0.1020 0.0910 0.0952 0.0988 0.0705 0.0977 0.1268 0.1076 0.1329
va: 1.2869 1.2583 1.1162 1.1168 1.1137 1.1147 2.1147 2.1313 3.7709 3.8745 3.8241 3.9093 3.9047 3.9161 4.2455 4.2437 3.8607 3.6391 3.9046 3.8782 4.0159 3.9927 3.8716 1.0361 1.0502 1.0092 1.0206 1.0025 1.0046 1.0035 1.0093 1.0281 1.0185 1.0105 1.0074
dispcorr: -0.016808437 hartree
energy: -2049.168073436791
dipole: -6.89275 7.80094 0.90818 -11.64554 10.95998 -0.68556 5.79747 -6.11678 -0.31932
magnitude: 1.18184 au
magnitude: 3.00400 debye
