program: Orca
programVersion: 5.0.2
elementType: Br Br Br Br O O O N C C C C C C C C C C C C C C C C C C C C C C H H H H H H H H H H H H H H H H H H H
charge: 0
multiplicity: 1
keywords: wb97x-d3
keywords: def2-TZVPP
keywords: def2/J RIJCOSX
keywords: DEFGRID2
keywords: scfconv7
keywords: smallprint printgap noloewdin
keywords: NOSOSCF
formula: C22H19Br4NO3
InChI: InChI=1/C22H19Br4NO3/c1-21(2)17(19(23)22(24,25)26)18(21)20(28)30-16(12-27)13-7-6-10-15(11-13)29-14-8-4-3-5-9-14/h3-11,16-19H,1-2H3
49 atoms
Br 3.621931 -1.001558 2.06619
Br 2.190891 -3.731311 0.521832
Br 1.350683 -1.902792 -1.881742
Br 4.365545 -2.133857 -1.0998
O  -1.893185 0.560307 -0.883039
O  -1.920047 -1.025074 0.694301
O  -4.795845 4.342606 1.266471
N  -3.728122 1.299671 -3.520678
C  0.575452 0.652011 1.698268
C  1.009893 -0.632962 1.068272
C  0.062169 0.269841 0.319154
C  2.398765 -0.840468 0.53946
C  1.489194 1.853946 1.730059
C  -0.32155 0.56422 2.908072
C  -1.327742 -0.161667 0.097966
C  2.569857 -2.063703 -0.376046
C  -3.275953 0.329107 -1.13635
C  -4.158749 1.007839 -0.117354
C  -3.512277 0.877982 -2.472812
C  -4.048237 2.381449 0.070058
C  -5.055424 0.258403 0.628623
C  -4.867634 3.004086 0.99936
C  -5.859377 0.895276 1.564281
C  -5.775086 2.264706 1.749418
C  -4.50645 5.241305 0.267622
C  -5.076855 5.151342 -0.996229
C  -3.665255 6.294472 0.594919
C  -4.78524 6.126962 -1.938771
C  -3.393343 7.269749 -0.354378
C  -3.945651 7.187905 -1.625119
H  0.555506 -1.514839 1.509264
H  0.480935 0.864176 -0.484844
H  2.735925 0.034947 -0.021604
H  2.142827 1.821058 2.601874
H  2.111958 1.947384 0.840774
H  0.89172 2.763875 1.800287
H  -0.925004 -0.340103 2.934411
H  0.290981 0.573021 3.81074
H  -0.991565 1.424038 2.954218
H  -3.49927 -0.74121 -1.179718
H  -3.333509 2.955481 -0.50814
H  -5.129211 -0.810806 0.479102
H  -6.563146 0.320939 2.151349
H  -6.407626 2.762972 2.472951
H  -5.744022 4.337016 -1.249228
H  -3.233855 6.353469 1.586052
H  -5.226708 6.057249 -2.924249
H  -2.739846 8.092812 -0.096783
H  -3.72651 7.946102 -2.364822
elementType: Br O N C H
nucrepener: 5498.30959672 hartree
twoeener: 9901.94689896 hartree
cpcmener: -0.03531592 hartree
xcener: -389.798114863072 hartree
chargesum: 0.0000000
charge: -0.082635 -0.011714 -0.012894 -0.002723 -0.279941 -0.454761 -0.336629 -0.100589 0.094699 -0.080826 -0.151009 -0.162270 -0.262501 -0.262678 0.404073 0.037723 0.439603 0.016968 -0.225650 -0.214721 -0.202327 0.261240 -0.113959 -0.239582 0.297189 -0.200448 -0.258786 -0.142210 -0.120727 -0.190429 0.118333 0.120926 0.168958 0.098155 0.094472 0.109754 0.094040 0.100325 0.105611 0.143520 0.147372 0.150131 0.162479 0.151644 0.158081 0.149162 0.162804 0.161378 0.161368
qa: -0.0826 -0.0117 -0.0129 -0.0027 -0.2799 -0.4548 -0.3366 -0.1006 0.0947 -0.0808 -0.1510 -0.1623 -0.2625 -0.2627 0.4041 0.0377 0.4396 0.0170 -0.2256 -0.2147 -0.2023 0.2612 -0.1140 -0.2396 0.2972 -0.2004 -0.2588 -0.1422 -0.1207 -0.1904 0.1183 0.1209 0.1690 0.0982 0.0945 0.1098 0.0940 0.1003 0.1056 0.1435 0.1474 0.1501 0.1625 0.1516 0.1581 0.1492 0.1628 0.1614 0.1614
va: 1.1826 1.2234 1.2268 1.2285 2.1295 2.0567 2.0717 3.1085 3.8662 3.7350 3.8820 4.0695 3.8995 3.9007 4.1461 4.3517 3.7042 3.5917 4.0850 3.9541 3.9573 3.7463 3.8971 4.0095 3.6693 3.9093 4.0118 3.8807 3.8748 3.9026 1.0431 1.0244 0.9932 1.0059 1.0035 1.0028 1.0177 1.0025 0.9993 1.0159 1.0146 1.0046 0.9881 1.0040 0.9969 1.0073 0.9889 0.9880 0.9893
dispcorr: -0.029374140 hartree
energy: -11427.159406565954
dipole: -142.37360 142.34967 -0.02394 123.57827 -122.56904 1.00923 17.47096 -16.35116 1.11980
magnitude: 1.50768 au
magnitude: 3.83221 debye
