program: Orca
programVersion: 5.0.2
elementType: Br Br Br Br O O O N C C C C C C C C C C C C C C C C C C C C C C H H H H H H H H H H H H H H H H H H H
charge: 0
multiplicity: 1
keywords: wb97x-d3
keywords: def2-TZVPP
keywords: def2/J RIJCOSX
keywords: DEFGRID2
keywords: scfconv7
keywords: smallprint printgap noloewdin
keywords: NOSOSCF
formula: C22H19Br4NO3
InChI: InChI=1/C22H19Br4NO3/c1-21(2)17(19(23)22(24,25)26)18(21)20(28)30-16(12-27)13-7-6-10-15(11-13)29-14-8-4-3-5-9-14/h3-11,16-19H,1-2H3
49 atoms
Br 3.413993 -2.191319 -1.361959
Br 3.360781 0.8758 0.239434
Br 1.5501 -0.36508 2.482454
Br 4.354705 -1.611825 1.876385
O  -2.517907 -0.95795 0.903134
O  -1.415842 0.619018 -0.236371
O  -5.614998 2.874882 -2.370664
N  -5.259854 -1.163487 2.74438
C  -0.065137 -2.080764 -1.331031
C  0.883498 -1.216733 -0.560856
C  -0.451824 -1.558198 0.043797
C  2.140185 -1.746608 0.063891
C  0.134844 -3.573309 -1.425136
C  -0.680457 -1.487365 -2.573423
C  -1.46651 -0.502072 0.201873
C  2.807582 -0.783912 1.059753
C  -3.626038 -0.073997 1.020652
C  -4.331951 0.136582 -0.298828
C  -4.525582 -0.704434 1.987307
C  -4.642065 1.42939 -0.690817
C  -4.645066 -0.950283 -1.105655
C  -5.2530 1.637569 -1.920474
C  -5.26655 -0.726002 -2.324432
C  -5.564905 0.562082 -2.741348
C  -4.920681 4.000797 -1.998019
C  -3.533066 4.034706 -1.92978
C  -5.671892 5.141032 -1.752272
C  -2.903595 5.225701 -1.596212
C  -5.027183 6.327899 -1.43439
C  -3.642852 6.374472 -1.347402
H  0.966994 -0.207912 -0.952211
H  -0.470335 -2.321414 0.814093
H  1.94983 -2.684249 0.593312
H  0.793186 -3.822838 -2.257439
H  0.551666 -4.010819 -0.518297
H  -0.824387 -4.059729 -1.607228
H  -1.674812 -1.901321 -2.748074
H  -0.76632 -0.403486 -2.534411
H  -0.061692 -1.733792 -3.437292
H  -3.317753 0.887274 1.444758
H  -4.396009 2.258652 -0.039616
H  -4.407816 -1.959995 -0.795554
H  -5.514111 -1.561917 -2.964546
H  -6.04003 0.734322 -3.698597
H  -2.941534 3.149446 -2.127482
H  -6.751788 5.10001 -1.815659
H  -1.823578 5.251993 -1.536415
H  -5.614919 7.216733 -1.246562
H  -3.143139 7.298748 -1.09019
elementType: Br O N C H
nucrepener: 5536.99993179 hartree
twoeener: 9940.29003814 hartree
cpcmener: -0.03650515 hartree
xcener: -389.800907656083 hartree
chargesum: 0.0000000
charge: -0.084226 -0.013512 -0.012814 -0.002219 -0.272702 -0.449695 -0.333993 -0.100246 0.102893 -0.085921 -0.147410 -0.155212 -0.264573 -0.264425 0.394779 0.036482 0.417544 0.027053 -0.218554 -0.220817 -0.261869 0.317720 -0.110435 -0.239167 0.313567 -0.217141 -0.261630 -0.138902 -0.117597 -0.193855 0.114705 0.121474 0.168479 0.098840 0.093958 0.109454 0.101506 0.095969 0.104172 0.143606 0.148772 0.149612 0.162701 0.150895 0.159408 0.147986 0.162591 0.161406 0.161348
qa: -0.0842 -0.0135 -0.0128 -0.0022 -0.2727 -0.4497 -0.3340 -0.1002 0.1029 -0.0859 -0.1474 -0.1552 -0.2646 -0.2644 0.3948 0.0365 0.4175 0.0271 -0.2186 -0.2208 -0.2619 0.3177 -0.1104 -0.2392 0.3136 -0.2171 -0.2616 -0.1389 -0.1176 -0.1939 0.1147 0.1215 0.1685 0.0988 0.0940 0.1095 0.1015 0.0960 0.1042 0.1436 0.1488 0.1496 0.1627 0.1509 0.1594 0.1480 0.1626 0.1614 0.1613
va: 1.1802 1.2222 1.2254 1.2301 2.1316 2.0549 2.0808 3.1105 3.8658 3.7454 3.8589 4.0586 3.8960 3.8996 4.1606 4.3597 3.7089 3.5816 4.0817 3.9584 3.9608 3.6940 3.8897 4.0068 3.6554 3.9172 4.0147 3.8795 3.8706 3.9083 1.0466 1.0239 0.9934 1.0052 1.0032 1.0031 1.0018 1.0138 1.0040 1.0172 1.0040 1.0114 0.9876 1.0049 0.9990 1.0079 0.9890 0.9879 0.9894
dispcorr: -0.030059223 hartree
energy: -11427.159288831124
dipole: -158.14401 158.54134 0.39733 37.45097 -37.91981 -0.46884 -55.08297 53.89629 -1.18668
magnitude: 1.33638 au
magnitude: 3.39680 debye
