program: Orca
programVersion: 5.0.2
elementType: Br Br Br Br O O O N C C C C C C C C C C C C C C C C C C C C C C H H H H H H H H H H H H H H H H H H H
charge: 0
multiplicity: 1
keywords: wb97x-d3
keywords: def2-TZVPP
keywords: def2/J RIJCOSX
keywords: DEFGRID2
keywords: scfconv7
keywords: smallprint printgap noloewdin
keywords: NOSOSCF
formula: C22H19Br4NO3
InChI: InChI=1/C22H19Br4NO3/c1-21(2)17(19(23)22(24,25)26)18(21)20(28)30-16(12-27)13-7-6-10-15(11-13)29-14-8-4-3-5-9-14/h3-11,16-19H,1-2H3
49 atoms
Br 3.857022 0.126787 0.757726
Br 2.192277 -2.175065 2.756649
Br 0.955468 -3.449186 0.171853
Br 4.058188 -3.291379 0.486008
O  -2.240573 -0.627551 -1.268006
O  -1.788335 -0.379352 0.907097
O  -3.16549 4.257577 -1.532973
N  -4.880134 -1.215131 -3.162077
C  0.750655 0.964412 -0.560188
C  1.102347 -0.214406 0.295363
C  -0.011739 -0.343698 -0.704312
C  2.37383 -0.989966 0.118025
C  1.601878 1.35319 -1.744294
C  0.120824 2.150635 0.126777
C  -1.402527 -0.457673 -0.230917
C  2.40672 -2.34521 0.844333
C  -3.628146 -0.526562 -0.974378
C  -4.024884 0.879079 -0.583444
C  -4.310617 -0.919178 -2.207724
C  -3.481093 1.957262 -1.26827
C  -4.921075 1.081834 0.454572
C  -3.815654 3.246163 -0.883846
C  -5.265841 2.378182 0.810351
C  -4.711756 3.467363 0.156067
C  -3.788948 5.458099 -1.768664
C  -3.028514 6.604624 -1.592896
C  -5.095714 5.53342 -2.233631
C  -3.581819 7.841629 -1.89175
C  -5.639354 6.778454 -2.516976
C  -4.888905 7.934867 -2.349452
H  0.782616 -0.110545 1.32722
H  0.194181 -0.872792 -1.628476
H  2.575268 -1.181524 -0.939312
H  2.048884 0.5012 -2.255733
H  0.989022 1.881734 -2.476033
H  2.403431 2.026533 -1.439443
H  0.904348 2.835234 0.455181
H  -0.528688 2.697653 -0.558816
H  -0.462334 1.880903 1.005207
H  -3.924166 -1.234652 -0.193535
H  -2.78562 1.81167 -2.086117
H  -5.33865 0.237806 0.988163
H  -5.958895 2.545909 1.623612
H  -4.970127 4.471861 0.465113
H  -2.009882 6.527003 -1.234634
H  -5.685906 4.637981 -2.382529
H  -2.98611 8.735103 -1.759201
H  -6.657345 6.840002 -2.878479
H  -5.319172 8.90086 -2.577055
elementType: Br O N C H
nucrepener: 5486.29976121 hartree
twoeener: 9890.02649343 hartree
cpcmener: -0.03674907 hartree
xcener: -389.800055501798 hartree
chargesum: -0.0000000
charge: -0.085051 -0.013174 -0.013607 -0.001400 -0.276271 -0.440048 -0.338730 -0.100316 0.113459 -0.095904 -0.149697 -0.156300 -0.266849 -0.267000 0.382945 0.036890 0.429509 0.042669 -0.223740 -0.298915 -0.207862 0.292581 -0.122962 -0.191853 0.275008 -0.248130 -0.187687 -0.129501 -0.153554 -0.181232 0.115757 0.124336 0.169410 0.094961 0.110434 0.098494 0.107542 0.097483 0.097080 0.147387 0.143006 0.149480 0.164209 0.161480 0.149956 0.160107 0.161144 0.162499 0.161958
qa: -0.0851 -0.0132 -0.0136 -0.0014 -0.2763 -0.4400 -0.3387 -0.1003 0.1135 -0.0959 -0.1497 -0.1563 -0.2668 -0.2670 0.3829 0.0369 0.4295 0.0427 -0.2237 -0.2989 -0.2079 0.2926 -0.1230 -0.1919 0.2750 -0.2481 -0.1877 -0.1295 -0.1536 -0.1812 0.1158 0.1243 0.1694 0.0950 0.1104 0.0985 0.1075 0.0975 0.0971 0.1474 0.1430 0.1495 0.1642 0.1615 0.1500 0.1601 0.1611 0.1625 0.1620
va: 1.1804 1.2219 1.2241 1.2304 2.1235 2.0667 2.0412 3.1094 3.8559 3.7635 3.8491 4.0623 3.8950 3.8966 4.1943 4.3545 3.6871 3.5659 4.0882 4.0368 3.9913 3.6973 3.8956 3.9392 3.6929 4.0004 3.9101 3.8854 3.8908 3.8914 1.0449 1.0224 0.9930 1.0035 1.0027 1.0055 1.0045 1.0041 1.0141 1.0132 1.0253 1.0014 0.9887 0.9936 1.0057 0.9964 0.9886 0.9892 0.9890
dispcorr: -0.030380459 hartree
energy: -11427.159585051493
dipole: -136.61663 136.49051 -0.12612 131.75010 -130.04057 1.70953 -53.80188 53.98809 0.18621
magnitude: 1.72426 au
magnitude: 4.38272 debye
