program: Orca
programVersion: 5.0.2
elementType: Br Br Br Br O O O N C C C C C C C C C C C C C C C C C C C C C C H H H H H H H H H H H H H H H H H H H
charge: 0
multiplicity: 1
keywords: wb97x-d3
keywords: def2-TZVPP
keywords: def2/J RIJCOSX
keywords: DEFGRID2
keywords: scfconv7
keywords: smallprint printgap noloewdin
keywords: NOSOSCF
formula: C22H19Br4NO3
InChI: InChI=1/C22H19Br4NO3/c1-21(2)17(19(23)22(24,25)26)18(21)20(28)30-16(12-27)13-7-6-10-15(11-13)29-14-8-4-3-5-9-14/h3-11,16-19H,1-2H3
49 atoms
Br 3.713056 0.122953 1.426053
Br 2.340619 -3.050683 1.426798
Br 1.053902 -2.461988 -1.371627
Br 4.149673 -2.235054 -1.016568
O  -2.253785 -0.013503 -1.01324
O  -1.916569 -0.763381 1.065582
O  -5.270666 4.005376 0.302369
N  -4.495282 -0.455731 -3.394762
C  0.463363 1.334369 0.896386
C  0.962678 -0.07107 0.797439
C  -0.160659 0.374589 -0.104112
C  2.2886 -0.427379 0.194272
C  1.233892 2.480598 0.2881
C  -0.275151 1.720898 2.153448
C  -1.502624 -0.199067 0.084701
C  2.454182 -1.919918 -0.136348
C  -3.604778 -0.454333 -0.938464
C  -4.455078 0.452512 -0.080929
C  -4.084299 -0.449888 -2.320744
C  -4.432402 1.823307 -0.312914
C  -5.241608 -0.087774 0.924281
C  -5.20162 2.653762 0.488382
C  -6.020132 0.756039 1.704402
C  -5.996935 2.124772 1.498775
C  -4.19238 4.697814 -0.196088
C  -4.444681 5.636359 -1.185034
C  -2.911115 4.523014 0.311649
C  -3.401199 6.414624 -1.667341
C  -1.875747 5.299652 -0.188289
C  -2.114042 6.246756 -1.176364
H  0.660993 -0.70083 1.628514
H  0.093372 0.592751 -1.135096
H  2.459956 0.13291 -0.728767
H  1.980371 2.858763 0.987076
H  1.7396 2.215931 -0.640301
H  0.55026 3.300346 0.060884
H  0.424413 2.169513 2.860263
H  -1.045914 2.462076 1.935629
H  -0.746026 0.87741 2.653043
H  -3.664814 -1.485395 -0.575717
H  -3.826768 2.232732 -1.113064
H  -5.247049 -1.156103 1.097541
H  -6.638095 0.345998 2.49162
H  -6.594699 2.784931 2.114015
H  -5.449693 5.762158 -1.567321
H  -2.717924 3.796016 1.090756
H  -3.59913 7.150892 -2.435169
H  -0.876601 5.166413 0.206048
H  -1.302368 6.851957 -1.557302
elementType: Br O N C H
nucrepener: 5603.04783564 hartree
cpcmener: -0.03785703 hartree
xcener: -389.801226748802 hartree
chargesum: -0.0000000
charge: -0.082569 -0.012280 -0.012348 -0.002584 -0.277904 -0.452351 -0.336751 -0.098953 0.098908 -0.090364 -0.135037 -0.159825 -0.263976 -0.260168 0.392904 0.038480 0.429634 0.014346 -0.222770 -0.208639 -0.209018 0.262186 -0.111594 -0.240541 0.292647 -0.244338 -0.223254 -0.122925 -0.154393 -0.191474 0.117535 0.119573 0.169105 0.099375 0.095603 0.103682 0.102644 0.095246 0.096519 0.143125 0.148257 0.149643 0.162609 0.150357 0.149017 0.187106 0.161367 0.172711 0.161476
qa: -0.0826 -0.0123 -0.0123 -0.0026 -0.2779 -0.4524 -0.3368 -0.0990 0.0989 -0.0904 -0.1350 -0.1598 -0.2640 -0.2602 0.3929 0.0385 0.4296 0.0143 -0.2228 -0.2086 -0.2090 0.2622 -0.1116 -0.2405 0.2926 -0.2443 -0.2233 -0.1229 -0.1544 -0.1915 0.1175 0.1196 0.1691 0.0994 0.0956 0.1037 0.1026 0.0952 0.0965 0.1431 0.1483 0.1496 0.1626 0.1504 0.1490 0.1871 0.1614 0.1727 0.1615
va: 1.1818 1.2233 1.2276 1.2301 2.1270 2.0584 2.0751 3.1113 3.8585 3.7409 3.8720 4.0661 3.9037 3.8950 4.1476 4.3510 3.7115 3.6079 4.0888 3.9374 3.9675 3.7461 3.8952 4.0065 3.7022 4.0068 3.9140 3.8773 3.8877 3.9231 1.0449 1.0247 0.9926 1.0061 1.0058 1.0115 1.0035 1.0047 1.0180 1.0166 1.0156 1.0028 0.9879 1.0048 1.0068 0.9724 0.9877 0.9824 0.9903
dispcorr: -0.031515584 hartree
energy: -11427.161555867095
dipole: -135.80016 136.37880 0.57864 113.32018 -111.91222 1.40796 3.02697 -2.10776 0.91920
magnitude: 1.77823 au
magnitude: 4.51990 debye
