program: Orca
programVersion: 5.0.2
elementType: Br Br Br Br O O O N C C C C C C C C C C C C C C C C C C C C C C H H H H H H H H H H H H H H H H H H H
charge: 0
multiplicity: 1
keywords: wb97x-d3
keywords: def2-TZVPP
keywords: def2/J RIJCOSX
keywords: DEFGRID2
keywords: scfconv7
keywords: smallprint printgap noloewdin
keywords: NOSOSCF
formula: C22H19Br4NO3
InChI: InChI=1/C22H19Br4NO3/c1-21(2)17(19(23)22(24,25)26)18(21)20(28)30-16(12-27)13-7-6-10-15(11-13)29-14-8-4-3-5-9-14/h3-11,16-19H,1-2H3
49 atoms
Br 3.522253 -1.173432 -1.572194
Br 3.229664 0.909287 1.147259
Br 1.181783 -1.081637 2.440738
Br 4.054985 -2.071056 1.708173
O  -2.551747 -1.013161 0.575208
O  -1.569211 0.928741 0.047974
O  -5.507525 3.045672 -2.111565
N  -5.029817 -1.953764 2.543934
C  0.040975 -1.013228 -1.875083
C  0.884767 -0.582901 -0.717683
C  -0.48758 -1.148558 -0.45567
C  2.084436 -1.352592 -0.24836
C  0.298139 -2.316687 -2.591081
C  -0.480116 0.068739 -2.789884
C  -1.551028 -0.276156 0.066053
C  2.609425 -0.919311 1.130521
C  -3.73148 -0.317191 0.975334
C  -4.561676 0.055593 -0.227803
C  -4.443749 -1.24552 1.853049
C  -4.685721 1.392824 -0.568081
C  -5.128437 -0.933856 -1.024923
C  -5.358519 1.738324 -1.732871
C  -5.823572 -0.5705 -2.166585
C  -5.932056 0.763807 -2.533922
C  -4.439738 3.902847 -1.987335
C  -3.1356 3.506043 -2.260615
C  -4.722955 5.210483 -1.621826
C  -2.11143 4.435787 -2.152683
C  -3.689067 6.131788 -1.531172
C  -2.380006 5.748885 -1.789043
H  0.967707 0.494678 -0.616084
H  -0.532412 -2.172751 -0.102598
H  1.86127 -2.421434 -0.190365
H  1.040661 -2.186781 -3.378686
H  0.63942 -3.112392 -1.929475
H  -0.62341 -2.661924 -3.062106
H  0.204646 0.188605 -3.630649
H  -1.456348 -0.203067 -3.194364
H  -0.569453 1.038803 -2.305147
H  -3.488216 0.56938 1.568977
H  -4.249777 2.154893 0.065807
H  -5.032477 -1.980209 -0.762462
H  -6.272761 -1.33223 -2.789257
H  -6.458631 1.045622 -3.436664
H  -2.910602 2.488827 -2.557008
H  -5.743896 5.50426 -1.413465
H  -1.095665 4.125991 -2.361394
H  -3.911912 7.152067 -1.247942
H  -1.575723 6.467743 -1.708901
elementType: Br O N C H
nucrepener: 5604.71391365 hartree
cpcmener: -0.03613165 hartree
xcener: -389.799823502261 hartree
chargesum: -0.0000000
charge: -0.081875 -0.013230 -0.012851 -0.002577 -0.269052 -0.458458 -0.341036 -0.099760 0.100320 -0.086480 -0.146682 -0.161718 -0.263727 -0.259171 0.407371 0.038194 0.417882 0.010242 -0.220847 -0.183975 -0.220347 0.267111 -0.132152 -0.219513 0.280888 -0.188738 -0.242441 -0.159501 -0.129942 -0.180759 0.120582 0.121186 0.169366 0.099082 0.094144 0.109234 0.102579 0.107947 0.081027 0.138776 0.149926 0.147978 0.163741 0.151454 0.163994 0.147760 0.162165 0.160606 0.161279
qa: -0.0819 -0.0132 -0.0129 -0.0026 -0.2691 -0.4585 -0.3410 -0.0998 0.1003 -0.0865 -0.1467 -0.1617 -0.2637 -0.2592 0.4074 0.0382 0.4179 0.0102 -0.2208 -0.1840 -0.2203 0.2671 -0.1322 -0.2195 0.2809 -0.1887 -0.2424 -0.1595 -0.1299 -0.1808 0.1206 0.1212 0.1694 0.0991 0.0941 0.1092 0.1026 0.1079 0.0810 0.1388 0.1499 0.1480 0.1637 0.1515 0.1640 0.1478 0.1622 0.1606 0.1613
va: 1.1824 1.2227 1.2262 1.2289 2.1328 2.0473 2.0699 3.1102 3.8583 3.7349 3.8712 4.0678 3.8976 3.9093 4.1347 4.3531 3.7268 3.5887 4.0749 3.9217 3.9830 3.7286 3.9061 4.0194 3.7002 3.8795 3.9969 3.8957 3.8852 3.8997 1.0410 1.0251 0.9922 1.0054 1.0038 1.0027 1.0048 0.9982 1.0152 1.0167 1.0104 1.0079 0.9881 1.0033 0.9895 1.0073 0.9900 0.9879 0.9891
dispcorr: -0.031106449 hartree
energy: -11427.160783209654
dipole: -147.91205 148.23175 0.31970 46.84670 -46.98567 -0.13897 -66.03425 64.19333 -1.84092
magnitude: 1.87364 au
magnitude: 4.76241 debye
