program: Orca
programVersion: 5.0.2
elementType: Br Br Br Br O O O N C C C C C C C C C C C C C C C C C C C C C C H H H H H H H H H H H H H H H H H H H
charge: 0
multiplicity: 1
keywords: wb97x-d3
keywords: def2-TZVPP
keywords: def2/J RIJCOSX
keywords: DEFGRID2
keywords: scfconv7
keywords: smallprint printgap noloewdin
keywords: NOSOSCF
formula: C22H19Br4NO3
InChI: InChI=1/C22H19Br4NO3/c1-21(2)17(19(23)22(24,25)26)18(21)20(28)30-16(12-27)13-7-6-10-15(11-13)29-14-8-4-3-5-9-14/h3-11,16-19H,1-2H3
49 atoms
Br 3.475529 -1.713955 -1.484793
Br 3.208126 0.993224 0.646372
Br 1.472272 -0.746323 2.59678
Br 4.3515 -1.684135 1.831573
O  -2.547301 -1.154901 0.827247
O  -1.497176 0.60339 -0.072342
O  -5.5504 2.822406 -2.241363
N  -5.256918 -1.756408 2.597511
C  -0.018723 -1.883901 -1.462132
C  0.883861 -1.076965 -0.579798
C  -0.439343 -1.548321 -0.040624
C  2.165958 -1.623149 -0.024499
C  0.246775 -3.345591 -1.728695
C  -0.657418 -1.178385 -2.632478
C  -1.505453 -0.565377 0.220047
C  2.760729 -0.818363 1.143962
C  -3.709624 -0.355098 1.025863
C  -4.417637 -0.052244 -0.273483
C  -4.565755 -1.151826 1.905197
C  -4.654519 1.267975 -0.623248
C  -4.798972 -1.091784 -1.113967
C  -5.262068 1.547593 -1.84069
C  -5.422139 -0.796407 -2.315596
C  -5.648231 0.520223 -2.689068
C  -4.695062 3.85942 -1.959628
C  -3.312473 3.721468 -1.994199
C  -5.279119 5.09082 -1.698454
C  -2.518134 4.833242 -1.750421
C  -4.471292 6.195372 -1.470206
C  -3.088846 6.071661 -1.488448
H  0.922591 -0.024545 -0.842553
H  -0.437105 -2.400188 0.630411
H  2.03589 -2.65067 0.3261
H  -0.686893 -3.842297 -1.997168
H  0.936329 -3.468877 -2.564207
H  0.653805 -3.875153 -0.86745
H  -0.038712 -1.312584 -3.520854
H  -1.64058 -1.601691 -2.846444
H  -0.77532 -0.107717 -2.478061
H  -3.466033 0.571321 1.556355
H  -4.357905 2.064319 0.048076
H  -4.616959 -2.12257 -0.836256
H  -5.727629 -1.596711 -2.975727
H  -6.124725 0.750241 -3.633378
H  -2.849684 2.765763 -2.206644
H  -6.357627 5.183374 -1.680278
H  -1.441608 4.72592 -1.773361
H  -4.929459 7.154989 -1.269865
H  -2.46121 6.932806 -1.302757
elementType: Br O N C H
nucrepener: 5559.26699628 hartree
twoeener: 9962.57357280 hartree
cpcmener: -0.03612662 hartree
xcener: -389.798264134280 hartree
chargesum: 0.0000000
charge: -0.083439 -0.013569 -0.011786 -0.003329 -0.267438 -0.450393 -0.336292 -0.100010 0.100947 -0.089073 -0.149991 -0.155321 -0.266835 -0.257417 0.395277 0.034817 0.418158 0.032176 -0.219058 -0.211200 -0.254258 0.297391 -0.116866 -0.231814 0.302262 -0.199719 -0.260135 -0.149505 -0.120862 -0.190578 0.117291 0.123335 0.169691 0.109435 0.098732 0.094871 0.102634 0.102659 0.091103 0.142300 0.150472 0.148438 0.163088 0.151327 0.160964 0.147882 0.161188 0.161429 0.161022
qa: -0.0834 -0.0136 -0.0118 -0.0033 -0.2674 -0.4504 -0.3363 -0.1000 0.1009 -0.0891 -0.1500 -0.1553 -0.2668 -0.2574 0.3953 0.0348 0.4182 0.0322 -0.2191 -0.2112 -0.2543 0.2974 -0.1169 -0.2318 0.3023 -0.1997 -0.2601 -0.1495 -0.1209 -0.1906 0.1173 0.1233 0.1697 0.1094 0.0987 0.0949 0.1026 0.1027 0.0911 0.1423 0.1505 0.1484 0.1631 0.1513 0.1610 0.1479 0.1612 0.1614 0.1610
va: 1.1812 1.2212 1.2251 1.2286 2.1373 2.0572 2.0754 3.1100 3.8739 3.7443 3.8588 4.0558 3.8959 3.9016 4.1732 4.3526 3.7162 3.5534 4.0812 3.9450 3.9656 3.7054 3.8927 4.0161 3.6720 3.9012 4.0070 3.8926 3.8753 3.9044 1.0429 1.0222 0.9932 1.0023 1.0055 1.0037 1.0041 1.0008 1.0141 1.0159 1.0053 1.0111 0.9877 1.0041 0.9949 1.0079 0.9900 0.9877 0.9893
dispcorr: -0.030307677 hartree
energy: -11427.159687649024
dipole: -154.26859 154.66659 0.39800 35.37225 -35.77086 -0.39861 -59.42158 58.07094 -1.35064
magnitude: 1.46339 au
magnitude: 3.71964 debye
