program: Orca
programVersion: 5.0.2
elementType: Br Br Br Br O O O N C C C C C C C C C C C C C C C C C C C C C C H H H H H H H H H H H H H H H H H H H
charge: 0
multiplicity: 1
keywords: wb97x-d3
keywords: def2-TZVPP
keywords: def2/J RIJCOSX
keywords: DEFGRID2
keywords: scfconv7
keywords: smallprint printgap noloewdin
keywords: NOSOSCF
formula: C22H19Br4NO3
InChI: InChI=1/C22H19Br4NO3/c1-21(2)17(19(23)22(24,25)26)18(21)20(28)30-16(12-27)13-7-6-10-15(11-13)29-14-8-4-3-5-9-14/h3-11,16-19H,1-2H3
49 atoms
Br 3.733569 -0.60237 -1.308514
Br 3.031425 0.18467 1.974399
Br 0.862541 -2.077951 2.039013
Br 3.824908 -2.7893 1.331669
O  -2.51165 -0.788805 0.2016
O  -1.428773 1.17215 0.23878
O  -5.488738 3.411513 -1.892121
N  -4.624233 -2.078653 2.380223
C  0.328966 -0.187433 -1.977007
C  1.019559 -0.256761 -0.653861
C  -0.407147 -0.743264 -0.768627
C  2.124793 -1.231663 -0.374689
C  0.625925 -1.197746 -3.059989
C  0.009118 1.180258 -2.527935
C  -1.464089 0.007163 -0.069148
C  2.449805 -1.442968 1.11294
C  -3.640442 -0.200859 0.853793
C  -4.634586 0.294623 -0.165166
C  -4.191121 -1.258749 1.700295
C  -4.618751 1.641463 -0.502677
C  -5.49634 -0.584836 -0.809777
C  -5.449279 2.097685 -1.517352
C  -6.347288 -0.105737 -1.793412
C  -6.319914 1.230406 -2.161826
C  -4.338589 4.164312 -1.904967
C  -3.118161 3.655593 -2.334768
C  -4.459868 5.493117 -1.525396
C  -2.013311 4.49445 -2.371739
C  -3.348302 6.322097 -1.579524
C  -2.120352 5.827068 -1.996024
H  1.13423 0.706745 -0.167202
H  -0.559577 -1.815813 -0.800145
H  1.894261 -2.213794 -0.795208
H  -0.233878 -1.280527 -3.726256
H  1.478562 -0.880551 -3.66085
H  0.832729 -2.19707 -2.678244
H  -0.89787 1.150273 -3.134085
H  -0.117255 1.936947 -1.757867
H  0.827026 1.50469 -3.173063
H  -3.332571 0.613199 1.515956
H  -3.960553 2.3225 0.021267
H  -5.514927 -1.635423 -0.548477
H  -7.029787 -0.781369 -2.290888
H  -6.973094 1.600455 -2.941648
H  -3.019008 2.622462 -2.643938
H  -5.417923 5.875576 -1.197055
H  -1.062718 4.098586 -2.705537
H  -3.445969 7.35931 -1.287187
H  -1.254456 6.474396 -2.030535
elementType: Br O N C H
nucrepener: 5594.54183966 hartree
twoeener: 9997.72618954 hartree
cpcmener: -0.03464769 hartree
xcener: -389.798245906180 hartree
chargesum: -0.0000000
charge: -0.081903 -0.014805 -0.011953 -0.003117 -0.272040 -0.463107 -0.336723 -0.099504 0.121052 -0.092719 -0.169891 -0.156495 -0.261008 -0.290167 0.435524 0.038537 0.409406 -0.005686 -0.215117 -0.185107 -0.208509 0.286444 -0.125783 -0.235702 0.313014 -0.225590 -0.261215 -0.138336 -0.117354 -0.200122 0.123131 0.120605 0.169151 0.109810 0.098013 0.094833 0.110544 0.089569 0.103659 0.136509 0.147479 0.142228 0.163506 0.150583 0.167088 0.147748 0.171599 0.160966 0.160957
qa: -0.0819 -0.0148 -0.0120 -0.0031 -0.2720 -0.4631 -0.3367 -0.0995 0.1211 -0.0927 -0.1699 -0.1565 -0.2610 -0.2902 0.4355 0.0385 0.4094 -0.0057 -0.2151 -0.1851 -0.2085 0.2864 -0.1258 -0.2357 0.3130 -0.2256 -0.2612 -0.1383 -0.1174 -0.2001 0.1231 0.1206 0.1692 0.1098 0.0980 0.0948 0.1105 0.0896 0.1037 0.1365 0.1475 0.1422 0.1635 0.1506 0.1671 0.1477 0.1716 0.1610 0.1610
va: 1.1827 1.2194 1.2270 1.2284 2.1262 2.0432 2.0782 3.1086 3.8316 3.7342 3.9280 4.0655 3.9006 3.8995 4.1099 4.3410 3.7309 3.6848 4.0664 3.9114 3.9913 3.7264 3.9087 4.0282 3.6817 3.9177 4.0119 3.8638 3.8779 3.9338 1.0387 1.0238 0.9928 1.0020 1.0060 1.0045 0.9942 1.0132 1.0048 1.0211 1.0165 1.0092 0.9884 1.0045 0.9868 1.0079 0.9837 0.9874 0.9908
dispcorr: -0.031105740 hartree
energy: -11427.160855109640
dipole: -140.97593 141.11190 0.13597 72.58758 -72.19137 0.39620 -69.24280 67.03208 -2.21072
magnitude: 2.25005 au
magnitude: 5.71918 debye
