program: Orca
programVersion: 5.0.2
elementType: Br Br Br Br O O O N C C C C C C C C C C C C C C C C C C C C C C H H H H H H H H H H H H H H H H H H H
charge: 0
multiplicity: 1
keywords: wb97x-d3
keywords: def2-TZVPP
keywords: def2/J RIJCOSX
keywords: DEFGRID2
keywords: scfconv7
keywords: smallprint printgap noloewdin
keywords: NOSOSCF
formula: C22H19Br4NO3
InChI: InChI=1/C22H19Br4NO3/c1-21(2)17(19(23)22(24,25)26)18(21)20(28)30-16(12-27)13-7-6-10-15(11-13)29-14-8-4-3-5-9-14/h3-11,16-19H,1-2H3
49 atoms
Br 4.021555 -2.515627 1.272815
Br 1.809979 -3.814349 -1.034402
Br 0.96861 -0.914417 -1.85511
Br 3.968353 -1.781521 -2.08702
O  -1.485714 0.688871 0.663125
O  -1.571556 -1.408992 1.420064
O  -5.622282 4.570173 1.009362
N  -3.356072 -1.086099 -1.537662
C  1.29909 -0.69959 2.578908
C  1.401703 -1.46223 1.29905
C  0.52001 -0.235231 1.361362
C  2.615392 -1.445512 0.419102
C  2.403914 0.231383 3.018052
C  0.60282 -1.372152 3.734851
C  -0.92849 -0.416517 1.183545
C  2.370478 -1.96545 -1.008467
C  -2.877107 0.640443 0.37227
C  -3.303608 2.013454 -0.077107
C  -3.128086 -0.341858 -0.690528
C  -4.245691 2.703561 0.669597
C  -2.746029 2.586386 -1.215013
C  -4.645524 3.970491 0.264702
C  -3.153423 3.851682 -1.60387
C  -4.105186 4.550804 -0.874495
C  -5.617305 5.933989 1.182838
C  -6.837126 6.587093 1.092051
C  -4.457378 6.629433 1.500752
C  -6.895877 7.954086 1.325683
C  -4.529742 7.997504 1.719973
C  -5.7446 8.66539 1.63377
H  0.866852 -2.406797 1.311314
H  0.913592 0.667723 0.909187
H  3.019139 -0.432784 0.333658
H  3.16805 -0.313088 3.573432
H  2.888172 0.746168 2.188682
H  1.996678 0.997149 3.679568
H  1.34011 -1.896554 4.344392
H  0.11291 -0.633988 4.371294
H  -0.141288 -2.101617 3.423758
H  -3.452357 0.333944 1.250756
H  -4.674739 2.260755 1.560224
H  -2.009446 2.051633 -1.801546
H  -2.7337 4.302221 -2.492994
H  -4.421738 5.53206 -1.203727
H  -7.732249 6.029477 0.847683
H  -3.507508 6.116209 1.582569
H  -7.848095 8.463505 1.258424
H  -3.62742 8.541413 1.966846
H  -5.793266 9.731638 1.809211
elementType: Br O N C H
nucrepener: 5433.91741173 hartree
twoeener: 9838.08319731 hartree
cpcmener: -0.03946544 hartree
xcener: -389.799329834202 hartree
chargesum: 0.0000000
charge: -0.079934 -0.013373 -0.017354 -0.002559 -0.267810 -0.453870 -0.337000 -0.094300 0.101332 -0.100084 -0.136740 -0.152653 -0.260946 -0.262464 0.391505 0.043983 0.437889 0.006703 -0.241811 -0.212384 -0.217573 0.250600 -0.156142 -0.161242 0.274099 -0.244512 -0.185476 -0.127973 -0.149904 -0.183175 0.120660 0.121235 0.169084 0.099080 0.093253 0.109371 0.099042 0.105514 0.092746 0.131560 0.140567 0.151833 0.163078 0.160019 0.149387 0.160766 0.160939 0.163144 0.161891
qa: -0.0799 -0.0134 -0.0174 -0.0026 -0.2678 -0.4539 -0.3370 -0.0943 0.1013 -0.1001 -0.1367 -0.1527 -0.2609 -0.2625 0.3915 0.0440 0.4379 0.0067 -0.2418 -0.2124 -0.2176 0.2506 -0.1561 -0.1612 0.2741 -0.2445 -0.1855 -0.1280 -0.1499 -0.1832 0.1207 0.1212 0.1691 0.0991 0.0933 0.1094 0.0990 0.1055 0.0927 0.1316 0.1406 0.1518 0.1631 0.1600 0.1494 0.1608 0.1609 0.1631 0.1619
va: 1.1844 1.2223 1.2290 1.2302 2.1602 2.0465 2.0614 3.1066 3.8689 3.7362 3.9004 4.0622 3.9018 3.8981 4.1482 4.3413 3.7005 3.7092 4.0303 4.0390 3.9809 3.7755 3.9349 3.9044 3.6810 4.0040 3.9082 3.8812 3.8874 3.8940 1.0437 1.0230 0.9921 1.0056 1.0037 1.0025 1.0017 0.9995 1.0178 1.0193 1.0153 1.0037 0.9902 0.9941 1.0067 0.9950 0.9883 0.9891 0.9891
dispcorr: -0.028624994 hartree
energy: -11427.159371138265
dipole: -129.28999 130.02229 0.73230 130.34852 -126.90157 3.44695 60.85621 -59.21118 1.64503
magnitude: 3.88894 au
magnitude: 9.88490 debye
