program: Orca
programVersion: 5.0.2
elementType: Br Br Br Br O O O N C C C C C C C C C C C C C C C C C C C C C C H H H H H H H H H H H H H H H H H H H
charge: 0
multiplicity: 1
keywords: wb97x-d3
keywords: def2-TZVPP
keywords: def2/J RIJCOSX
keywords: DEFGRID2
keywords: scfconv7
keywords: smallprint printgap noloewdin
keywords: NOSOSCF
formula: C22H19Br4NO3
InChI: InChI=1/C22H19Br4NO3/c1-21(2)17(19(23)22(24,25)26)18(21)20(28)30-16(12-27)13-7-6-10-15(11-13)29-14-8-4-3-5-9-14/h3-11,16-19H,1-2H3
49 atoms
Br 3.895528 -2.635717 1.3392
Br 2.751586 -2.642085 -1.92192
Br 1.216351 0.035007 -1.361818
Br 4.314057 -0.098553 -0.940555
O  -2.140955 -0.53521 0.706197
O  -1.624064 -2.57158 -0.052186
O  -3.851808 4.166991 0.922601
N  -2.771168 -0.352113 -2.596799
C  0.524662 -2.382921 2.315117
C  1.12988 -2.192522 0.962837
C  -0.083397 -1.381007 1.349022
C  2.431145 -1.487937 0.719095
C  1.161729 -1.776716 3.541744
C  -0.156578 -3.699846 2.588362
C  -1.331423 -1.602826 0.602871
C  2.671274 -1.105295 -0.752502
C  -3.344152 -0.556855 -0.049408
C  -4.198518 0.607833 0.37887
C  -3.013453 -0.453863 -1.476718
C  -3.660037 1.88795 0.425396
C  -5.527726 0.388023 0.707997
C  -4.458987 2.94631 0.829898
C  -6.317685 1.46015 1.099321
C  -5.79208 2.739559 1.171363
C  -4.583622 5.314942 0.723824
C  -5.385646 5.477817 -0.398136
C  -4.442293 6.333179 1.653791
C  -6.057662 6.677694 -0.578383
C  -5.111114 7.533209 1.454104
C  -5.923251 7.70876 0.342771
H  0.928031 -3.012609 0.281219
H  0.08815 -0.34813 1.630121
H  2.497979 -0.572964 1.313778
H  1.633532 -0.813255 3.349205
H  0.402949 -1.617143 4.309132
H  1.914595 -2.447398 3.956401
H  -0.958647 -3.574337 3.316985
H  -0.576382 -4.158973 1.696024
H  0.565688 -4.401355 3.008401
H  -3.892478 -1.491345 0.100094
H  -2.626649 2.071178 0.155292
H  -5.942281 -0.610721 0.665163
H  -7.353235 1.296674 1.365291
H  -6.417841 3.559768 1.4980
H  -5.485419 4.682773 -1.1265
H  -3.811149 6.190286 2.521614
H  -6.685172 6.80726 -1.450261
H  -4.998524 8.330244 2.177214
H  -6.446748 8.643445 0.192986
elementType: Br O N C H
nucrepener: 5473.32566496 hartree
twoeener: 9878.11972699 hartree
cpcmener: -0.03849703 hartree
xcener: -389.799031584274 hartree
chargesum: -0.0000000
charge: -0.082548 -0.013094 -0.016274 -0.002459 -0.274852 -0.451040 -0.336671 -0.096210 0.098134 -0.100532 -0.134743 -0.149205 -0.260168 -0.260822 0.390583 0.043156 0.448532 -0.002178 -0.240059 -0.227886 -0.183075 0.234230 -0.146207 -0.169364 0.263401 -0.181421 -0.234837 -0.149974 -0.132084 -0.177505 0.117254 0.122151 0.169471 0.093265 0.109246 0.098234 0.105227 0.093044 0.099228 0.130038 0.137786 0.150509 0.163589 0.159629 0.161595 0.148761 0.162730 0.161522 0.161893
qa: -0.0825 -0.0131 -0.0163 -0.0025 -0.2749 -0.4510 -0.3367 -0.0962 0.0981 -0.1005 -0.1347 -0.1492 -0.2602 -0.2608 0.3906 0.0432 0.4485 -0.0022 -0.2401 -0.2279 -0.1831 0.2342 -0.1462 -0.1694 0.2634 -0.1814 -0.2348 -0.1500 -0.1321 -0.1775 0.1173 0.1222 0.1695 0.0933 0.1092 0.0982 0.1052 0.0930 0.0992 0.1300 0.1378 0.1505 0.1636 0.1596 0.1616 0.1488 0.1627 0.1615 0.1619
va: 1.1817 1.2219 1.2299 1.2302 2.1568 2.0508 2.0623 3.1053 3.8715 3.7357 3.8901 4.0553 3.9021 3.8997 4.1555 4.3471 3.6928 3.7442 4.0284 4.0755 3.9447 3.8039 3.9151 3.8950 3.6853 3.9142 4.0026 3.8843 3.8808 3.8905 1.0466 1.0213 0.9929 1.0034 1.0027 1.0057 0.9999 1.0167 1.0022 1.0225 1.0269 1.0010 0.9904 0.9946 0.9945 1.0064 0.9892 0.9882 0.9890
dispcorr: -0.028597633 hartree
energy: -11427.159147030832
dipole: -156.67743 154.93142 -1.74601 66.80812 -65.77516 1.03296 53.93940 -50.85399 3.08541
magnitude: 3.69260 au
magnitude: 9.38584 debye
