program: Orca
programVersion: 5.0.2
elementType: Br Br Br Br O O O N C C C C C C C C C C C C C C C C C C C C C C H H H H H H H H H H H H H H H H H H H
charge: 0
multiplicity: 1
keywords: wb97x-d3
keywords: def2-TZVPP
keywords: def2/J RIJCOSX
keywords: DEFGRID2
keywords: scfconv7
keywords: smallprint printgap noloewdin
keywords: NOSOSCF
formula: C22H19Br4NO3
InChI: InChI=1/C22H19Br4NO3/c1-21(2)17(19(23)22(24,25)26)18(21)20(28)30-16(12-27)13-7-6-10-15(11-13)29-14-8-4-3-5-9-14/h3-11,16-19H,1-2H3
49 atoms
Br 3.567843 -1.477261 1.94978
Br 2.016921 -3.752052 -0.149919
Br 1.265666 -1.403645 -2.08803
Br 4.264897 -1.917501 -1.368255
O  -1.997588 0.582566 -0.562826
O  -1.955087 -1.222027 0.757703
O  -5.604104 4.140256 1.21806
N  -3.684028 1.306931 -3.298955
C  0.530449 0.267606 1.993434
C  0.955461 -0.851611 1.099037
C  -0.022077 0.175235 0.58023
C  2.333614 -0.949936 0.515427
C  1.438276 1.446658 2.248161
C  -0.322312 -0.079897 3.188376
C  -1.403491 -0.25539 0.299621
C  2.464696 -1.94161 -0.654036
C  -3.354806 0.30288 -0.909774
C  -4.309216 0.895247 0.097777
C  -3.530811 0.87668 -2.24541
C  -4.492838 2.274234 0.148301
C  -4.954663 0.060352 0.997738
C  -5.32719 2.812845 1.117315
C  -5.787878 0.614465 1.960463
C  -5.972429 1.983246 2.029853
C  -4.79106 5.075976 0.629898
C  -3.447109 5.175491 0.965944
C  -5.370693 5.964659 -0.262034
C  -2.68034 6.177468 0.390023
C  -4.594746 6.970999 -0.821102
C  -3.248254 7.077141 -0.503159
H  0.510089 -1.80697 1.358544
H  0.363109 0.93153 -0.09422
H  2.677345 0.0239 0.155755
H  2.046009 1.720609 1.385623
H  0.840039 2.321145 2.509805
H  2.109219 1.24544 3.083938
H  -0.923059 -0.97507 3.045209
H  0.321701 -0.255377 4.051824
H  -0.993599 0.74328 3.439186
H  -3.521516 -0.774881 -0.998987
H  -3.997953 2.915292 -0.571657
H  -4.812133 -1.010896 0.951932
H  -6.294162 -0.027487 2.669252
H  -6.621161 2.414968 2.781805
H  -3.002514 4.483816 1.671082
H  -6.421195 5.874746 -0.508949
H  -1.632377 6.257808 0.648427
H  -5.047641 7.66937 -1.512989
H  -2.644687 7.859267 -0.944603
elementType: Br O N C H
nucrepener: 5513.17636923 hartree
twoeener: 9916.62748015 hartree
cpcmener: -0.02956831 hartree
xcener: -389.799406717603 hartree
chargesum: -0.0000000
charge: -0.080268 -0.011151 -0.012067 -0.002249 -0.271546 -0.439646 -0.322404 -0.086077 0.094968 -0.096770 -0.155304 -0.152939 -0.262173 -0.265425 0.411005 0.037361 0.405437 -0.011611 -0.230945 -0.190709 -0.190624 0.269606 -0.113018 -0.238034 0.265918 -0.197464 -0.224199 -0.140427 -0.129102 -0.173196 0.119390 0.117641 0.166936 0.091988 0.109091 0.099157 0.095357 0.099774 0.104649 0.137610 0.140508 0.142638 0.158316 0.147682 0.159247 0.146202 0.159118 0.158683 0.159065
qa: -0.0803 -0.0112 -0.0121 -0.0022 -0.2715 -0.4396 -0.3224 -0.0861 0.0950 -0.0968 -0.1553 -0.1529 -0.2622 -0.2654 0.4110 0.0374 0.4054 -0.0116 -0.2309 -0.1907 -0.1906 0.2696 -0.1130 -0.2380 0.2659 -0.1975 -0.2242 -0.1404 -0.1291 -0.1732 0.1194 0.1176 0.1669 0.0920 0.1091 0.0992 0.0954 0.0998 0.1046 0.1376 0.1405 0.1426 0.1583 0.1477 0.1592 0.1462 0.1591 0.1587 0.1591
va: 1.1836 1.2237 1.2273 1.2301 2.1330 2.0748 2.0873 3.1121 3.8702 3.7379 3.9034 4.0646 3.9013 3.9001 4.1441 4.3471 3.7425 3.6721 4.0746 3.9670 3.9464 3.7765 3.9114 4.0050 3.6995 3.9387 4.0141 3.8854 3.8856 3.9017 1.0448 1.0245 0.9941 1.0044 1.0027 1.0060 1.0183 1.0027 0.9993 1.0166 1.0130 1.0138 0.9894 1.0063 0.9960 1.0066 0.9901 0.9893 0.9902
dispcorr: -0.029218484 hartree
energy: -11427.174873586660
dipole: -138.84573 139.10222 0.25649 115.46499 -114.41838 1.04660 37.70832 -36.05856 1.64976
magnitude: 1.97050 au
magnitude: 5.00861 debye
