program: Gaussian 09
title: 000063856
version: EM64L-G09RevD.01
frameworkgroup: C1[X(C19H16N4O2S)]
method: RPBEPBE
basis: SDD
operation: Freq
keyword: #p
keyword: freq=noraman
keyword: PBEPBE/SDD
title: #p freq=noraman PBEPBE/SDD
converged: YES YES NO NO
title: Mulliken charges:
elementType: S O O N N N N C C C C C C C C C C C C C C C C C C C H H H H H H H H H H H H H H H H
charge: 0.220420 -0.198165 -0.244328 -0.120240 -0.144626 -0.031645 -0.023858 -0.398537 -0.210178 0.325668 -0.773843 0.204738 0.127750 0.057766 -0.220269 -0.322892 -0.333218 0.291918 -0.239504 -0.204150 -0.327498 -0.382714 0.440104 -0.381494 -0.364848 -0.806594 0.294098 0.247879 0.298170 0.309496 0.259891 0.271808 0.262225 0.235302 0.235091 0.248827 0.243451 0.232012 0.232601 0.226193 0.237804 0.225388
chargesum: 0.00000
title: Mulliken charges with hydrogens summed into heavy atoms:
elementType: S O O N N N N C C C C C C C C C C C C C C C C C C C
charge: 0.220420 -0.198165 -0.244328 -0.120240 -0.144626 -0.031645 -0.023858 0.143440 -0.210178 0.325668 -0.166177 0.204738 0.127750 0.057766 0.039621 -0.051084 -0.070993 0.291918 -0.004202 0.030941 -0.078671 -0.139263 0.440104 -0.149482 -0.132247 -0.117209
polarizability: 2.98364156e+02 4.31746303e+01 3.11092426e+02 -2.53947913e+01 -9.61806236e+00 1.98836806e+02
1716.lowfreq: -6.5981 -0.7930 -0.0003 0.0011 0.0013 3.7366 15.2681 21.4433 22.9121
frequency: 15.1958 21.3652 22.9002 32.4571 38.2566 55.2275 72.4973 87.9348 97.3982 114.2231 131.9447 160.4908 165.0744 225.4868 237.5658 257.6233 280.7604 294.4981 305.0878 336.8624 356.0974 399.1041 409.8017 423.4195 432.2813 457.8312 462.2303 489.4007 502.2532 524.5771 527.4585 538.8102 551.4438 577.5253 584.1931 594.6292 596.0446 633.7356 649.8294 685.0386 697.7858 717.2827 728.3623 751.5680 769.6023 785.2605 797.2006 821.9461 827.9263 838.5017 841.7832 878.6722 882.9640 898.4330 901.9507 944.3605 951.5893 969.9118 977.7707 981.3356 986.6508 1004.5345 1007.1697 1025.1454 1046.3287 1053.5122 1094.8829 1120.9198 1126.4843 1139.7471 1157.1373 1167.5712 1186.0233 1198.9378 1223.2944 1224.5324 1230.1334 1240.9395 1280.1026 1286.9292 1297.3932 1305.7736 1358.4911 1368.0948 1380.6651 1392.1104 1397.1104 1407.3211 1414.0604 1426.9521 1446.6163 1451.5589 1457.1804 1470.9180 1473.2358 1500.8139 1556.1793 1565.8140 1571.3283 1609.2192 1616.7127 1620.0378 1637.5525 1683.6183 2974.1011 3036.9354 3050.4109 3055.2516 3085.1608 3104.7418 3121.6309 3124.5498 3125.9756 3136.0176 3147.3210 3150.3047 3157.9519 3163.4362 3165.5443 3175.5580
redmass: 4.2884 1.1158 3.7576 6.1643 6.9516 5.6901 6.7310 6.4483 5.6051 3.7085 5.0913 6.3848 5.7463 4.6547 6.8186 6.5871 5.0933 6.7501 7.0673 3.2167 2.6209 4.7600 2.9695 3.0888 7.4704 10.5189 3.8589 7.6016 4.0672 5.8613 4.7567 4.8224 4.9594 6.9337 7.1627 3.7226 5.2466 5.4388 6.6726 5.1260 5.2591 3.1890 5.3552 5.0514 5.8854 1.5270 3.5879 5.1318 1.5475 1.2650 5.4272 2.2609 2.2113 1.6397 1.5216 5.3996 1.3574 1.3755 3.1338 1.3762 1.4134 1.3344 2.8257 2.0588 1.5567 4.8924 2.2585 1.2911 1.1522 3.4647 1.8482 1.8086 1.2599 2.0903 2.3280 3.0702 1.4234 2.4767 1.8739 3.1954 5.2272 1.3817 4.9479 1.7323 1.8963 1.9755 1.2239 1.5498 3.3006 1.0873 1.3930 1.8723 2.7498 1.1002 1.0538 2.6609 6.6468 7.3975 6.0200 9.7717 6.7328 7.2059 11.4710 11.3544 1.0389 1.0578 1.0571 1.0946 1.0998 1.1070 1.0881 1.1068 1.0886 1.0862 1.0958 1.0902 1.0963 1.0931 1.0959 1.0995
irintensity: 0.0973 0.4858 0.1561 0.7549 0.3385 2.6681 0.3716 1.1771 0.7925 10.3735 2.7436 0.2848 0.8756 1.2342 2.6506 1.4820 0.9021 4.3184 3.3718 6.5705 14.6397 5.1187 0.6413 12.2722 29.5194 12.0956 2.3883 1.1310 14.9512 1.4844 9.6272 11.1318 2.0151 5.5163 1.8587 2.5287 8.3261 4.8517 1.9883 16.0438 13.4715 4.9812 22.6510 5.5703 23.0340 77.1736 0.4486 10.0984 45.3096 5.3693 0.9694 24.5024 44.5524 6.0475 5.0849 2.4967 4.3155 1.3139 28.5596 3.6234 0.1694 0.0175 4.1481 11.4944 22.2563 9.7906 19.6838 17.3634 0.8207 83.2780 41.2021 105.2310 8.3993 12.3008 13.7150 27.7583 65.7935 30.2688 79.4308 98.6999 251.4881 19.7930 3.2513 20.5371 9.7041 19.2959 7.9828 14.9705 0.7968 11.2125 34.2411 14.4480 47.3008 9.9520 12.7881 47.4941 82.3242 58.2193 24.2728 174.6949 126.0404 20.0074 876.3388 91.2503 43.4505 11.8609 5.9535 22.7460 17.4321 5.5441 15.1805 0.6252 26.2348 4.4962 11.0676 7.1005 8.0923 5.5536 10.6193 19.2472
temp: 298.150 k
press: 1.00000 atm
elementType: 16 8 8 7 7 7 7 6 6 6 6 6 6 6 6 6 6 6 6 6 6 6 6 6 6 6 1 1 1 1 1 1 1 1 1 1 1 1 1 1 1 1
symmnumber: 1
zpe: 827202.1 jmol-1
zpe.correction: 0.315065 hartree
zpe.thermalcorrener: 0.337559 hartree
zpe.thermalcorrenthalpy: 0.338503 hartree
zpe.thermalcorrgfe: 0.259325 hartree
zpe.sumelectzpe: -1499.357031 hartree
zpe.sumelectthermal: -1499.334537 hartree
zpe.sumelectthermalent: -1499.333593 hartree
zpe.sumelectthermalfe: -1499.412770 hartree
dipole: -2.2982 -2.0643 -0.6864
dipole: 3.1645
quadrupole: -147.5045 -158.3377 -146.6943
quadrupole: -9.2178 -4.9771 0.9134
quadrupole: 3.3409 -7.4922 4.1512 -9.2178 -4.9771 0.9134
hfenergy: -1499.6720955 hartree
pointgroup: C01 [X(C19H16N4O2S1)]
dipole: 0.8735964 -0.8520598 0.246667 debye
polarizability: 299.7216038|-41.555157|310.1068559|-23.0288539|17.842326|198.4649292 unknown
InChI: InChI=1S/C19H16N4O2S/c1-13-6-8-14(9-7-13)21-19-23(17(24)10-26-19)12-22-11-20-16-5-3-2-4-15(16)18(22)25/h2-9,11H,10,12H2,1H3
charge 0 multiplicity 1
42 atoms
S  1.980685 2.575604 1.665743
O  -1.006014 4.488044 -0.175284
O  -2.794673 1.832433 0.350921
N  0.145334 2.436891 -0.306105
N  -1.365318 0.666757 -1.095744
N  -1.538505 -1.708024 -1.49464
N  1.713032 0.686941 -0.480142
C  -0.664127 1.924613 -1.422495
C  1.277671 1.724367 0.149783
C  -0.149906 3.691012 0.272116
C  0.718143 3.968448 1.49605
C  -2.470613 0.731672 -0.183707
C  -3.140101 -0.56444 0.03204
C  -2.656225 -1.74022 -0.631494
C  -0.955257 -0.542284 -1.678059
C  -4.264982 -0.644314 0.893998
C  -3.31473 -2.981085 -0.415075
C  2.793727 -0.152267 -0.109433
C  -4.906458 -1.877248 1.096588
C  -4.427722 -3.046461 0.43966
C  3.102018 -0.496939 1.235972
C  3.569713 -0.71834 -1.155371
C  4.974462 -1.916306 0.478121
C  4.17708 -1.365754 1.514319
C  4.648695 -1.573975 -0.861085
C  6.113031 -2.872033 0.787337
H  -1.403052 2.714991 -1.641512
H  -0.014538 1.73053 -2.291068
H  1.237313 4.931411 1.377748
H  0.082622 3.997786 2.395121
H  -0.069236 -0.476636 -2.315973
H  -4.609298 0.272295 1.38408
H  -2.927446 -3.865354 -0.929704
H  -5.775382 -1.94162 1.759802
H  -4.931967 -4.005263 0.602811
H  2.488183 -0.111875 2.057893
H  3.319074 -0.464837 -2.190601
H  4.397807 -1.624517 2.557081
H  5.244942 -1.988793 -1.68275
H  6.557563 -2.666905 1.777095
H  5.76034 -3.922018 0.797422
H  6.915318 -2.803788 0.031641
