program: Orca
programVersion: 5.0.2
elementType: Br Br Br Br O O O N C C C C C C C C C C C C C C C C C C C C C C H H H H H H H H H H H H H H H H H H H
charge: 0
multiplicity: 1
keywords: wb97x-d3
keywords: def2-TZVPP
keywords: def2/J RIJCOSX
keywords: DEFGRID2
keywords: scfconv7
keywords: smallprint printgap noloewdin
keywords: NOSOSCF
formula: C22H19Br4NO3
InChI: InChI=1/C22H19Br4NO3/c1-21(2)17(19(23)22(24,25)26)18(21)20(28)30-16(12-27)13-7-6-10-15(11-13)29-14-8-4-3-5-9-14/h3-11,16-19H,1-2H3
49 atoms
Br 3.935792 -1.590666 -1.017496
Br 3.257681 -0.05073 1.998689
Br 0.861689 -2.034957 2.429474
Br 3.759223 -3.152014 2.026767
O  -2.404981 -0.950425 0.009073
O  -1.081527 0.848007 0.088918
O  -5.163511 4.169664 -0.983752
N  -5.376799 -1.828964 1.109737
C  0.591238 -1.007675 -1.893452
C  1.246595 -0.870195 -0.555496
C  -0.204869 -1.266228 -0.625507
C  2.254883 -1.854259 -0.040717
C  0.834804 -2.221374 -2.757105
C  0.366589 0.251356 -2.692507
C  -1.227768 -0.32335 -0.141645
C  2.53021 -1.761799 1.469348
C  -3.502976 -0.146398 0.414591
C  -3.998806 0.763492 -0.685809
C  -4.545484 -1.100467 0.798849
C  -4.322623 2.074581 -0.3772
C  -4.129531 0.290123 -1.985945
C  -4.800659 2.916556 -1.37252
C  -4.593134 1.147552 -2.97162
C  -4.937014 2.458946 -2.676917
C  -4.996778 5.239507 -1.822881
C  -3.819551 5.443152 -2.532128
C  -6.031552 6.161016 -1.885518
C  -3.69028 6.582625 -3.312941
C  -5.883247 7.301787 -2.661577
C  -4.716757 7.515425 -3.382113
H  1.426613 0.158646 -0.259545
H  -0.445038 -2.310704 -0.460997
H  1.94289 -2.880157 -0.254743
H  -0.022724 -2.384148 -3.412281
H  1.710947 -2.078705 -3.390382
H  0.977593 -3.137854 -2.184592
H  0.261746 1.140856 -2.074785
H  1.213973 0.416389 -3.359966
H  -0.528901 0.160914 -3.310302
H  -3.252978 0.439926 1.305647
H  -4.207765 2.447708 0.633609
H  -3.877353 -0.732925 -2.234671
H  -4.700989 0.789326 -3.986955
H  -5.311764 3.106415 -3.459412
H  -3.006223 4.730199 -2.474524
H  -6.941454 5.989403 -1.323991
H  -2.773494 6.7433 -3.865567
H  -6.689958 8.022222 -2.705678
H  -4.606023 8.403291 -3.990615
elementType: Br O N C H
nucrepener: 5441.92741376 hartree
twoeener: 9845.32565467 hartree
cpcmener: -0.03161106 hartree
xcener: -389.803573149489 hartree
chargesum: -0.0000000
charge: -0.080547 -0.010888 -0.012200 -0.001294 -0.273207 -0.424802 -0.325785 -0.085491 0.097849 -0.084282 -0.142882 -0.163342 -0.261909 -0.261141 0.372761 0.036231 0.404945 0.030657 -0.226729 -0.226904 -0.230697 0.258503 -0.137078 -0.170233 0.270299 -0.184543 -0.240032 -0.146337 -0.125450 -0.179061 0.117338 0.118401 0.168301 0.108823 0.099190 0.091034 0.096396 0.101543 0.099859 0.142458 0.134534 0.147440 0.160498 0.158164 0.158786 0.146188 0.159137 0.157477 0.158022
qa: -0.0805 -0.0109 -0.0122 -0.0013 -0.2732 -0.4248 -0.3258 -0.0855 0.0978 -0.0843 -0.1429 -0.1633 -0.2619 -0.2611 0.3728 0.0362 0.4049 0.0307 -0.2267 -0.2269 -0.2307 0.2585 -0.1371 -0.1702 0.2703 -0.1845 -0.2400 -0.1463 -0.1254 -0.1791 0.1173 0.1184 0.1683 0.1088 0.0992 0.0910 0.0964 0.1015 0.0999 0.1425 0.1345 0.1474 0.1605 0.1582 0.1588 0.1462 0.1591 0.1575 0.1580
va: 1.1846 1.2230 1.2275 1.2308 2.1227 2.0898 2.0779 3.1135 3.8715 3.7350 3.8595 4.0677 3.8993 3.8991 4.1827 4.3525 3.7192 3.6112 4.0777 4.0838 3.9619 3.7771 3.9138 3.9115 3.6983 3.9125 4.0066 3.8930 3.8878 3.9022 1.0452 1.0246 0.9939 1.0023 1.0060 1.0042 1.0168 1.0034 1.0011 1.0169 1.0182 1.0126 0.9904 0.9951 0.9964 1.0077 0.9905 0.9894 0.9904
dispcorr: -0.029124251 hartree
energy: -11427.174690012600
dipole: -146.29687 146.74766 0.45079 89.94740 -89.41633 0.53107 -88.37334 86.19196 -2.18137
magnitude: 2.28990 au
magnitude: 5.82046 debye
