program: Orca
programVersion: 5.0.2
elementType: Br Br Br Br O O O N C C C C C C C C C C C C C C C C C C C C C C H H H H H H H H H H H H H H H H H H H
charge: 0
multiplicity: 1
keywords: wb97x-d3
keywords: def2-TZVPP
keywords: def2/J RIJCOSX
keywords: DEFGRID2
keywords: scfconv7
keywords: smallprint printgap noloewdin
keywords: NOSOSCF
formula: C22H19Br4NO3
InChI: InChI=1/C22H19Br4NO3/c1-21(2)17(19(23)22(24,25)26)18(21)20(28)30-16(12-27)13-7-6-10-15(11-13)29-14-8-4-3-5-9-14/h3-11,16-19H,1-2H3
49 atoms
Br 3.623829 -1.87627 -1.309692
Br 3.342774 0.594977 1.121607
Br 1.150613 -1.130378 2.556911
Br 3.992909 -2.339484 2.06718
O  -2.368207 -0.579046 0.62812
O  -1.174684 0.977574 -0.446204
O  -5.27322 2.756167 -2.934313
N  -4.462971 -0.410757 3.163224
C  0.161675 -1.546602 -1.769414
C  1.034064 -0.980102 -0.695671
C  -0.410661 -1.28977 -0.385084
C  2.13167 -1.764023 -0.03916
C  0.25889 -3.003332 -2.155747
C  -0.184933 -0.653069 -2.934518
C  -1.319341 -0.165831 -0.09885
C  2.631829 -1.192948 1.298783
C  -3.368232 0.392567 0.931834
C  -4.372621 0.498889 -0.189402
C  -3.98476 -0.069885 2.176457
C  -4.360685 1.627769 -0.998502
C  -5.248346 -0.549453 -0.444884
C  -5.249005 1.709868 -2.064364
C  -6.122628 -0.455655 -1.516055
C  -6.131737 0.669493 -2.324555
C  -4.841065 3.999781 -2.55203
C  -3.963904 4.658392 -3.400379
C  -5.30989 4.611983 -1.396387
C  -3.553266 5.947071 -3.088417
C  -4.87952 5.894461 -1.089579
C  -4.002561 6.566819 -1.931055
H  1.251803 0.075659 -0.822856
H  -0.614976 -2.190898 0.181403
H  1.821586 -2.795829 0.145547
H  1.027627 -3.152591 -2.914842
H  0.482015 -3.661505 -1.315969
H  -0.690323 -3.335609 -2.579422
H  -1.17097 -0.9001 -3.331841
H  -0.175555 0.405143 -2.684371
H  0.54156 -0.80492 -3.734563
H  -2.918672 1.368543 1.139201
H  -3.658725 2.426399 -0.795512
H  -5.257696 -1.43177 0.183514
H  -6.812023 -1.263567 -1.722095
H  -6.818305 0.7429 -3.158617
H  -3.61159 4.16851 -4.299498
H  -6.004694 4.099833 -0.742197
H  -2.872727 6.463434 -3.753049
H  -5.240563 6.372419 -0.18809
H  -3.675451 7.569073 -1.687477
elementType: Br O N C H
nucrepener: 5509.38210963 hartree
twoeener: 9913.06065943 hartree
cpcmener: -0.02914776 hartree
xcener: -389.800450160298 hartree
chargesum: 0.0000000
charge: -0.080221 -0.011125 -0.011095 -0.001376 -0.269575 -0.441198 -0.323456 -0.086746 0.097490 -0.095525 -0.159319 -0.154029 -0.259570 -0.266439 0.412374 0.034989 0.400910 -0.015555 -0.224606 -0.166098 -0.217117 0.288315 -0.121515 -0.236426 0.279782 -0.239492 -0.199904 -0.123188 -0.137732 -0.180135 0.119312 0.117505 0.168608 0.098252 0.091814 0.108927 0.104873 0.096136 0.099260 0.135129 0.138214 0.142561 0.158948 0.147456 0.146802 0.158065 0.158021 0.159503 0.158196
qa: -0.0802 -0.0111 -0.0111 -0.0014 -0.2696 -0.4412 -0.3235 -0.0867 0.0975 -0.0955 -0.1593 -0.1540 -0.2596 -0.2664 0.4124 0.0350 0.4009 -0.0156 -0.2246 -0.1661 -0.2171 0.2883 -0.1215 -0.2364 0.2798 -0.2395 -0.1999 -0.1232 -0.1377 -0.1801 0.1193 0.1175 0.1686 0.0983 0.0918 0.1089 0.1049 0.0961 0.0993 0.1351 0.1382 0.1426 0.1589 0.1475 0.1468 0.1581 0.1580 0.1595 0.1582
va: 1.1839 1.2227 1.2281 1.2307 2.1324 2.0720 2.0887 3.1119 3.8661 3.7378 3.9077 4.0624 3.9013 3.9002 4.1395 4.3446 3.7469 3.6675 4.0634 3.9028 3.9977 3.7416 3.9150 4.0160 3.6903 4.0165 3.9310 3.8821 3.8845 3.9053 1.0435 1.0237 0.9935 1.0060 1.0045 1.0023 0.9991 1.0183 1.0025 1.0191 1.0221 1.0085 0.9898 1.0063 1.0073 0.9961 0.9893 0.9899 0.9906
dispcorr: -0.029031237 hartree
energy: -11427.174833612249
dipole: -154.66778 154.36479 -0.30299 56.81664 -57.07591 -0.25926 -70.55302 68.87159 -1.68143
magnitude: 1.72807 au
magnitude: 4.39240 debye
