program: Orca
programVersion: 5.0.2
elementType: Br Br Br Br O O O N C C C C C C C C C C C C C C C C C C C C C C H H H H H H H H H H H H H H H H H H H
charge: 0
multiplicity: 1
keywords: wb97x-d3
keywords: def2-TZVPP
keywords: def2/J RIJCOSX
keywords: DEFGRID2
keywords: scfconv7
keywords: smallprint printgap noloewdin
keywords: NOSOSCF
formula: C22H19Br4NO3
InChI: InChI=1/C22H19Br4NO3/c1-21(2)17(19(23)22(24,25)26)18(21)20(28)30-16(12-27)13-7-6-10-15(11-13)29-14-8-4-3-5-9-14/h3-11,16-19H,1-2H3
49 atoms
Br 3.632104 -1.027702 2.052985
Br 2.179904 -3.735849 0.486025
Br 1.34265 -1.875834 -1.902022
Br 4.359601 -2.144009 -1.11641
O  -1.896403 0.565988 -0.866644
O  -1.906662 -1.029324 0.698994
O  -4.826884 4.348764 1.240969
N  -3.737297 1.262997 -3.512914
C  0.586571 0.647222 1.703579
C  1.016571 -0.633808 1.061636
C  0.06691 0.276238 0.324009
C  2.404264 -0.845286 0.530363
C  1.503382 1.846953 1.741338
C  -0.306226 0.552282 2.916246
C  -1.323872 -0.15906 0.107005
C  2.562064 -2.061377 -0.397914
C  -3.276136 0.322565 -1.118826
C  -4.163109 1.006559 -0.106338
C  -3.517655 0.852144 -2.463137
C  -4.060684 2.382893 0.067105
C  -5.055249 0.259851 0.647436
C  -4.88561 3.011947 0.987715
C  -5.863406 0.902003 1.575858
C  -5.78861 2.273553 1.745196
C  -4.524801 5.246048 0.251278
C  -5.061688 5.151304 -1.027207
C  -3.704928 6.310044 0.599176
C  -4.756866 6.130549 -1.961718
C  -3.42003 7.288741 -0.342278
C  -3.937981 7.200935 -1.626955
H  0.559162 -1.517381 1.49627
H  0.480561 0.87662 -0.478377
H  2.744862 0.03122 -0.026952
H  2.158067 1.809798 2.612506
H  2.127365 1.944333 0.852935
H  0.909579 2.75948 1.815611
H  -0.920965 -0.344953 2.932324
H  0.308674 0.541058 3.81776
H  -0.967657 1.418326 2.977944
H  -3.491084 -0.750096 -1.146524
H  -3.347735 2.954801 -0.515652
H  -5.121959 -0.81185 0.511463
H  -6.56335 0.32928 2.169715
H  -6.424668 2.77631 2.462984
H  -5.71405 4.330443 -1.298325
H  -3.300294 6.373477 1.601715
H  -5.172697 6.056216 -2.958395
H  -2.783036 8.119708 -0.067507
H  -3.708916 7.962164 -2.361008
elementType: Br O N C H
nucrepener: 5496.26118044 hartree
twoeener: 9899.85371879 hartree
cpcmener: -0.02996145 hartree
xcener: -389.799283087741 hartree
chargesum: 0.0000000
charge: -0.080470 -0.010669 -0.011555 -0.002686 -0.278375 -0.431287 -0.324777 -0.087300 0.092106 -0.082304 -0.151201 -0.161297 -0.261811 -0.260559 0.388773 0.037516 0.425872 0.022075 -0.231334 -0.220038 -0.197659 0.262907 -0.110964 -0.237699 0.296459 -0.202627 -0.256836 -0.137247 -0.116582 -0.187379 0.118160 0.118401 0.166009 0.098641 0.092461 0.109084 0.095086 0.099543 0.103663 0.139898 0.145596 0.145549 0.158832 0.148873 0.156045 0.146078 0.159571 0.157641 0.157816
qa: -0.0805 -0.0107 -0.0116 -0.0027 -0.2784 -0.4313 -0.3248 -0.0873 0.0921 -0.0823 -0.1512 -0.1613 -0.2618 -0.2606 0.3888 0.0375 0.4259 0.0221 -0.2313 -0.2200 -0.1977 0.2629 -0.1110 -0.2377 0.2965 -0.2026 -0.2568 -0.1372 -0.1166 -0.1874 0.1182 0.1184 0.1660 0.0986 0.0925 0.1091 0.0951 0.0995 0.1037 0.1399 0.1456 0.1455 0.1588 0.1489 0.1560 0.1461 0.1596 0.1576 0.1578
va: 1.1838 1.2240 1.2280 1.2285 2.1285 2.0842 2.0874 3.1104 3.8698 3.7333 3.8829 4.0715 3.8997 3.9008 4.1705 4.3510 3.7242 3.5940 4.0784 3.9569 3.9642 3.7584 3.9028 4.0107 3.6819 3.9156 4.0145 3.8868 3.8802 3.9103 1.0439 1.0248 0.9948 1.0061 1.0038 1.0030 1.0182 1.0026 0.9997 1.0171 1.0153 1.0061 0.9894 1.0051 0.9976 1.0084 0.9900 0.9892 0.9906
dispcorr: -0.029315547 hartree
energy: -11427.175310705768
dipole: -142.21775 142.17813 -0.03962 123.68516 -122.69977 0.98538 18.15312 -16.99352 1.15960
magnitude: 1.52225 au
magnitude: 3.86924 debye
