program: Orca
programVersion: 5.0.2
elementType: Br Br Br Br O O O N C C C C C C C C C C C C C C C C C C C C C C H H H H H H H H H H H H H H H H H H H
charge: 0
multiplicity: 1
keywords: wb97x-d3
keywords: def2-TZVPP
keywords: def2/J RIJCOSX
keywords: DEFGRID2
keywords: scfconv7
keywords: smallprint printgap noloewdin
keywords: NOSOSCF
formula: C22H19Br4NO3
InChI: InChI=1/C22H19Br4NO3/c1-21(2)17(19(23)22(24,25)26)18(21)20(28)30-16(12-27)13-7-6-10-15(11-13)29-14-8-4-3-5-9-14/h3-11,16-19H,1-2H3
49 atoms
Br 3.749491 0.460306 0.102889
Br 2.456633 -1.254558 2.810288
Br 1.010184 -3.216791 0.832148
Br 4.11604 -2.895603 0.696399
O  -2.418799 -1.125249 -1.047766
O  -1.854668 -0.234828 0.922772
O  -3.952103 3.418625 -2.411277
N  -5.072462 -2.522892 -2.426509
C  0.474962 0.822937 -1.032063
C  0.972934 -0.085907 0.049746
C  -0.19901 -0.518762 -0.78779
C  2.274561 -0.826896 -0.04924
C  1.205344 0.949825 -2.346686
C  -0.188708 2.108741 -0.603238
C  -1.5386 -0.599457 -0.17808
C  2.461961 -1.934634 1.002214
C  -3.782325 -1.09959 -0.65582
C  -4.34848 0.303669 -0.620291
C  -4.485049 -1.903903 -1.657888
C  -3.905342 1.250696 -1.533547
C  -5.299996 0.634279 0.332953
C  -4.412368 2.539881 -1.476226
C  -5.816078 1.921811 0.360994
C  -5.378056 2.88259 -0.536268
C  -3.772075 4.736703 -2.083961
C  -3.143312 5.120671 -0.90537
C  -4.18907 5.683011 -3.008076
C  -2.944552 6.470791 -0.655693
C  -3.971532 7.029292 -2.750352
C  -3.356469 7.429334 -1.572444
H  0.72214 0.251752 1.050551
H  -0.014366 -1.249004 -1.568454
H  2.383719 -1.291506 -1.033085
H  1.691681 0.026768 -2.662193
H  0.499969 1.22649 -3.132298
H  1.963059 1.732419 -2.296858
H  -0.723975 2.025262 0.341039
H  0.567873 2.885771 -0.480805
H  -0.892628 2.452485 -1.36342
H  -3.925382 -1.587696 0.314589
H  -3.164612 1.007733 -2.285964
H  -5.633463 -0.10405 1.051141
H  -6.564157 2.185281 1.096906
H  -5.788064 3.883825 -0.498955
H  -2.806169 4.380991 -0.188996
H  -4.67403 5.366566 -3.923144
H  -2.457174 6.772393 0.262582
H  -4.294306 7.767203 -3.473419
H  -3.195295 8.480233 -1.371225
elementType: Br O N C H
nucrepener: 5537.62903871 hartree
twoeener: 9940.92219811 hartree
cpcmener: -0.03164065 hartree
xcener: -389.800654649762 hartree
chargesum: 0.0000000
charge: -0.081555 -0.010504 -0.012993 -0.001792 -0.275291 -0.415410 -0.330366 -0.085678 0.116489 -0.081889 -0.152676 -0.167996 -0.265655 -0.271026 0.366418 0.038351 0.405232 0.025558 -0.227870 -0.247754 -0.198012 0.241548 -0.127205 -0.171414 0.282056 -0.181844 -0.242414 -0.157866 -0.125333 -0.175440 0.115584 0.120255 0.167450 0.092032 0.110171 0.099596 0.099148 0.107969 0.092811 0.145827 0.140853 0.143553 0.160301 0.158290 0.157815 0.146325 0.159000 0.157445 0.157908
qa: -0.0816 -0.0105 -0.0130 -0.0018 -0.2753 -0.4154 -0.3304 -0.0857 0.1165 -0.0819 -0.1527 -0.1680 -0.2657 -0.2710 0.3664 0.0384 0.4052 0.0256 -0.2279 -0.2478 -0.1980 0.2415 -0.1272 -0.1714 0.2821 -0.1818 -0.2424 -0.1579 -0.1253 -0.1754 0.1156 0.1203 0.1675 0.0920 0.1102 0.0996 0.0991 0.1080 0.0928 0.1458 0.1409 0.1436 0.1603 0.1583 0.1578 0.1463 0.1590 0.1574 0.1579
va: 1.1832 1.2251 1.2250 1.2298 2.1173 2.0943 2.0592 3.1126 3.8651 3.7456 3.8570 4.0762 3.8948 3.8928 4.2017 4.3552 3.7129 3.6207 4.0756 4.0130 3.9961 3.7945 3.9017 3.9109 3.6683 3.8942 4.0177 3.9102 3.8900 3.8997 1.0460 1.0245 0.9936 1.0036 1.0034 1.0052 1.0146 1.0053 1.0029 1.0138 1.0239 1.0029 0.9900 0.9946 0.9955 1.0077 0.9909 0.9893 0.9902
dispcorr: -0.031013135 hartree
energy: -11427.176049007647
dipole: -138.69166 138.84659 0.15493 107.72638 -105.91094 1.81544 -59.88072 60.05379 0.17306
magnitude: 1.83024 au
magnitude: 4.65209 debye
