program: Orca
programVersion: 5.0.2
elementType: Br Br Br Br O O O N C C C C C C C C C C C C C C C C C C C C C C H H H H H H H H H H H H H H H H H H H
charge: 0
multiplicity: 1
keywords: wb97x-d3
keywords: def2-TZVPP
keywords: def2/J RIJCOSX
keywords: DEFGRID2
keywords: scfconv7
keywords: smallprint printgap noloewdin
keywords: NOSOSCF
formula: C22H19Br4NO3
InChI: InChI=1/C22H19Br4NO3/c1-21(2)17(19(23)22(24,25)26)18(21)20(28)30-16(12-27)13-7-6-10-15(11-13)29-14-8-4-3-5-9-14/h3-11,16-19H,1-2H3
49 atoms
Br 3.699706 0.524586 -0.007927
Br 2.483537 -1.08906 2.803824
Br 1.043335 -3.16426 0.960382
Br 4.14452 -2.799931 0.748059
O  -2.443824 -1.228516 -1.03543
O  -1.878264 -0.313322 0.923727
O  -3.991465 3.302524 -2.415315
N  -5.091147 -2.655089 -2.397013
C  0.399964 0.761484 -1.099842
C  0.934809 -0.091408 0.010119
C  -0.231696 -0.588713 -0.797656
C  2.254149 -0.802632 -0.072247
C  1.112286 0.861467 -2.42639
C  -0.296248 2.041724 -0.706833
C  -1.565033 -0.683484 -0.175896
C  2.477613 -1.853596 1.028717
C  -3.806665 -1.209092 -0.640892
C  -4.380983 0.191082 -0.613624
C  -4.506246 -2.024224 -1.636421
C  -3.939665 1.135684 -1.530538
C  -5.335864 0.522838 0.33552
C  -4.450315 2.422992 -1.479209
C  -5.85763 1.808524 0.35607
C  -5.420383 2.76658 -0.544244
C  -3.745406 4.605176 -2.073852
C  -3.151521 4.956433 -0.867232
C  -4.060737 5.572557 -3.017166
C  -2.887055 6.293957 -0.609117
C  -3.778684 6.904395 -2.749487
C  -3.199139 7.272558 -1.543285
H  0.684682 0.278436 0.999624
H  -0.032423 -1.342823 -1.551674
H  2.36152 -1.312235 -1.033736
H  1.849862 1.664475 -2.412216
H  1.618848 -0.059511 -2.714995
H  0.391633 1.09237 -3.212887
H  0.439221 2.843003 -0.615763
H  -1.015512 2.341556 -1.470985
H  -0.819681 1.972347 0.245292
H  -3.945059 -1.692079 0.332768
H  -3.19637 0.892212 -2.280159
H  -5.667934 -0.213174 1.056773
H  -6.60876 2.072154 1.088779
H  -5.832554 3.767183 -0.513261
H  -2.891976 4.203403 -0.133196
H  -4.518258 5.282418 -3.954817
H  -2.427181 6.568614 0.331539
H  -4.022859 7.656993 -3.488027
H  -2.988081 8.312996 -1.334196
elementType: Br O N C H
nucrepener: 5550.79223409 hartree
twoeener: 9954.05012241 hartree
cpcmener: -0.03171004 hartree
xcener: -389.801201831943 hartree
chargesum: 0.0000000
charge: -0.080998 -0.012172 -0.012484 -0.001435 -0.275048 -0.413618 -0.331226 -0.085393 0.122933 -0.085803 -0.154204 -0.166995 -0.266554 -0.271433 0.365540 0.038305 0.404755 0.025898 -0.228439 -0.250171 -0.195782 0.240849 -0.124711 -0.172354 0.301198 -0.190903 -0.251224 -0.159596 -0.123358 -0.178219 0.115878 0.121009 0.166353 0.099794 0.092442 0.110222 0.108915 0.091061 0.098610 0.146064 0.143677 0.143627 0.160267 0.158832 0.156156 0.146228 0.158743 0.157217 0.157548
qa: -0.0810 -0.0122 -0.0125 -0.0014 -0.2750 -0.4136 -0.3312 -0.0854 0.1229 -0.0858 -0.1542 -0.1670 -0.2666 -0.2714 0.3655 0.0383 0.4048 0.0259 -0.2284 -0.2502 -0.1958 0.2408 -0.1247 -0.1724 0.3012 -0.1909 -0.2512 -0.1596 -0.1234 -0.1782 0.1159 0.1210 0.1664 0.0998 0.0924 0.1102 0.1089 0.0911 0.0986 0.1461 0.1437 0.1436 0.1603 0.1588 0.1562 0.1462 0.1587 0.1572 0.1575
va: 1.1832 1.2229 1.2250 1.2300 2.1172 2.0957 2.0580 3.1124 3.8630 3.7499 3.8551 4.0767 3.8939 3.8911 4.2051 4.3563 3.7125 3.6160 4.0756 4.0160 3.9960 3.7933 3.8973 3.9183 3.6465 3.8900 4.0181 3.9142 3.8904 3.9021 1.0454 1.0246 0.9940 1.0049 1.0034 1.0036 1.0055 1.0040 1.0142 1.0134 1.0216 1.0028 0.9899 0.9939 0.9963 1.0081 0.9909 0.9893 0.9902
dispcorr: -0.031321444 hartree
energy: -11427.176029614622
dipole: -139.34936 139.48570 0.13634 102.35821 -100.62693 1.73128 -60.83438 60.99691 0.16253
magnitude: 1.74423 au
magnitude: 4.43348 debye
