program: Orca
programVersion: 5.0.2
elementType: Br Br Br Br O O O N C C C C C C C C C C C C C C C C C C C C C C H H H H H H H H H H H H H H H H H H H
charge: 0
multiplicity: 1
keywords: wb97x-d3
keywords: def2-TZVPP
keywords: def2/J RIJCOSX
keywords: DEFGRID2
keywords: scfconv7
keywords: smallprint printgap noloewdin
keywords: NOSOSCF
formula: C22H19Br4NO3
InChI: InChI=1/C22H19Br4NO3/c1-21(2)17(19(23)22(24,25)26)18(21)20(28)30-16(12-27)13-7-6-10-15(11-13)29-14-8-4-3-5-9-14/h3-11,16-19H,1-2H3
49 atoms
Br 3.767084 0.610904 -0.708943
Br 3.043023 -0.960015 2.280652
Br 1.053331 -2.860131 0.778011
Br 4.057326 -2.753512 -0.09768
O  -2.571786 -0.602514 -0.262086
O  -1.480565 0.358484 1.447244
O  -4.997728 3.586715 -1.730406
N  -4.569099 -3.1394 0.397343
C  0.334959 1.143388 -1.086487
C  1.03206 0.251424 -0.105691
C  -0.337015 -0.130156 -0.600309
C  2.223722 -0.582514 -0.474268
C  0.720152 1.15676 -2.546007
C  -0.134297 2.488446 -0.589766
C  -1.478521 -0.085635 0.331097
C  2.580076 -1.677868 0.54584
C  -3.786614 -0.647283 0.466698
C  -4.815245 0.304427 -0.112913
C  -4.23076 -2.042592 0.41894
C  -4.393621 1.506513 -0.668732
C  -6.170202 0.011376 -0.025279
C  -5.340583 2.413176 -1.128772
C  -7.101318 0.923787 -0.499227
C  -6.696868 2.128258 -1.047423
C  -3.881352 4.277927 -1.338494
C  -3.061466 4.78212 -2.33754
C  -3.611214 4.533824 0.000324
C  -1.964225 5.558903 -1.99174
C  -2.504548 5.302159 0.331356
C  -1.678495 5.818512 -0.658827
H  1.059282 0.651434 0.902849
H  -0.400602 -0.909092 -1.352122
H  2.071348 -1.077463 -1.437629
H  1.530158 1.863902 -2.727591
H  1.030806 0.182143 -2.922639
H  -0.133853 1.47416 -3.146993
H  -0.356533 2.500187 0.475587
H  0.641608 3.234846 -0.767689
H  -1.028586 2.806508 -1.129148
H  -3.617382 -0.396781 1.51974
H  -3.341101 1.744201 -0.757431
H  -6.514519 -0.919218 0.407651
H  -8.156475 0.693436 -0.435069
H  -7.423058 2.841496 -1.416072
H  -3.286954 4.575631 -3.376437
H  -4.258396 4.149487 0.779217
H  -1.327399 5.955302 -2.772067
H  -2.294889 5.504846 1.373763
H  -0.819946 6.420614 -0.392049
elementType: Br O N C H
nucrepener: 5608.96737741 hartree
cpcmener: -0.02952683 hartree
xcener: -389.799322350697 hartree
chargesum: -0.0000000
charge: -0.081590 -0.013098 -0.011952 -0.002031 -0.274822 -0.417222 -0.325200 -0.085715 0.140188 -0.093579 -0.171522 -0.159067 -0.271976 -0.260850 0.384634 0.039272 0.413210 -0.011816 -0.213861 -0.170416 -0.219569 0.260195 -0.109387 -0.238516 0.250513 -0.207075 -0.176159 -0.136187 -0.144866 -0.178465 0.116757 0.119632 0.166482 0.100918 0.094330 0.110052 0.102905 0.110568 0.057029 0.136461 0.156043 0.138151 0.158962 0.146542 0.144513 0.156673 0.156553 0.157457 0.156900
qa: -0.0816 -0.0131 -0.0120 -0.0020 -0.2748 -0.4172 -0.3252 -0.0857 0.1402 -0.0936 -0.1715 -0.1591 -0.2720 -0.2609 0.3846 0.0393 0.4132 -0.0118 -0.2139 -0.1704 -0.2196 0.2602 -0.1094 -0.2385 0.2505 -0.2071 -0.1762 -0.1362 -0.1449 -0.1785 0.1168 0.1196 0.1665 0.1009 0.0943 0.1101 0.1029 0.1106 0.0570 0.1365 0.1560 0.1382 0.1590 0.1465 0.1445 0.1567 0.1566 0.1575 0.1569
va: 1.1829 1.2215 1.2267 1.2303 2.1193 2.0992 2.0847 3.1062 3.8445 3.7594 3.8767 4.0677 3.8982 3.8915 4.1936 4.3513 3.7239 3.7786 4.0502 3.9358 3.9737 3.7609 3.9233 4.0105 3.7125 3.9544 3.9019 3.8617 3.8528 3.8535 1.0461 1.0258 0.9941 1.0050 1.0040 1.0016 1.0151 1.0044 1.0144 1.0258 0.9761 1.0131 0.9895 1.0069 1.0075 0.9961 0.9903 0.9914 0.9916
dispcorr: -0.032261425 hartree
energy: -11427.176926877602
dipole: -143.62324 143.49882 -0.12443 94.84404 -92.87210 1.97194 -36.97289 35.97712 -0.99577
magnitude: 2.21259 au
magnitude: 5.62397 debye
