program: Orca
programVersion: 5.0.2
elementType: Br Br Br Br O O O N C C C C C C C C C C C C C C C C C C C C C C H H H H H H H H H H H H H H H H H H H
charge: 0
multiplicity: 1
keywords: wb97x-d3
keywords: def2-TZVPP
keywords: def2/J RIJCOSX
keywords: DEFGRID2
keywords: scfconv7
keywords: smallprint printgap noloewdin
keywords: NOSOSCF
formula: C22H19Br4NO3
InChI: InChI=1/C22H19Br4NO3/c1-21(2)17(19(23)22(24,25)26)18(21)20(28)30-16(12-27)13-7-6-10-15(11-13)29-14-8-4-3-5-9-14/h3-11,16-19H,1-2H3
49 atoms
Br 3.899265 -0.992719 0.264301
Br 1.713574 1.644735 0.491993
Br -0.445829 -0.242043 1.763378
Br 2.3458 0.104498 3.152948
O  -2.171122 -2.786384 -0.711417
O  -1.322795 -1.25414 -2.098313
O  -3.830207 2.587571 -0.716651
N  -4.180052 -2.314332 -3.464923
C  1.395774 -2.755491 -1.435336
C  1.260389 -1.495656 -0.64304
C  0.12539 -2.496022 -0.648864
C  1.987942 -1.236144 0.643205
C  2.230745 -3.907988 -0.931428
C  1.409869 -2.626533 -2.938301
C  -1.156592 -2.092592 -1.251154
C  1.459547 -0.025385 1.43505
C  -3.502052 -2.33487 -0.942008
C  -3.755125 -1.034487 -0.217052
C  -3.837902 -2.296916 -2.368645
C  -3.744097 0.189176 -0.868253
C  -3.912612 -1.092777 1.165042
C  -3.845455 1.358356 -0.124071
C  -4.047522 0.080182 1.889971
C  -4.000211 1.311861 1.252575
C  -2.951411 2.843931 -1.735823
C  -3.380777 3.710159 -2.731315
C  -1.666776 2.313758 -1.764517
C  -2.516204 4.045937 -3.763085
C  -0.819424 2.646108 -2.811246
C  -1.236339 3.511175 -3.81337
H  1.096105 -0.614108 -1.255496
H  0.024467 -3.112635 0.237258
H  1.926945 -2.106019 1.302433
H  3.267912 -3.805991 -1.251903
H  2.220529 -4.007573 0.154081
H  1.849735 -4.844108 -1.343184
H  2.438374 -2.51153 -3.284399
H  1.001636 -3.523828 -3.406577
H  0.845841 -1.770271 -3.301308
H  -4.126539 -3.1190 -0.507416
H  -3.645905 0.242065 -1.945157
H  -3.930987 -2.049425 1.672504
H  -4.178477 0.039053 2.963243
H  -4.084254 2.230667 1.818859
H  -4.382432 4.119951 -2.695278
H  -1.323106 1.647966 -0.983525
H  -2.852468 4.723672 -4.537118
H  0.177128 2.224273 -2.839803
H  -0.568318 3.766622 -4.625241
elementType: Br O N C H
nucrepener: 5988.92908036 hartree
cpcmener: -0.03224237 hartree
xcener: -389.806074765787 hartree
chargesum: 0.0000000
charge: -0.080534 -0.019537 -0.026591 -0.006417 -0.273891 -0.434605 -0.327251 -0.080067 0.090235 -0.100874 -0.086226 -0.168917 -0.262138 -0.261824 0.373152 0.081980 0.460128 0.000648 -0.245895 -0.161829 -0.268154 0.248545 -0.130440 -0.201234 0.275663 -0.242673 -0.134010 -0.126955 -0.126506 -0.179432 0.114844 0.112635 0.166108 0.099045 0.090355 0.109387 0.099271 0.103080 0.094789 0.145294 0.142602 0.141416 0.159282 0.147347 0.145128 0.084603 0.156781 0.146264 0.157418
qa: -0.0805 -0.0195 -0.0266 -0.0064 -0.2739 -0.4346 -0.3273 -0.0801 0.0902 -0.1009 -0.0862 -0.1689 -0.2621 -0.2618 0.3732 0.0820 0.4601 0.0006 -0.2459 -0.1618 -0.2682 0.2485 -0.1304 -0.2012 0.2757 -0.2427 -0.1340 -0.1270 -0.1265 -0.1794 0.1148 0.1126 0.1661 0.0990 0.0904 0.1094 0.0993 0.1031 0.0948 0.1453 0.1426 0.1414 0.1593 0.1473 0.1451 0.0846 0.1568 0.1463 0.1574
va: 1.1834 1.2210 1.2319 1.2284 2.1341 2.0583 2.0910 3.1063 3.8886 3.7475 3.8648 4.0721 3.8973 3.8971 4.1357 4.2921 3.8555 3.5693 4.0656 3.9116 3.9457 3.7949 3.8390 3.9829 3.7572 3.9904 3.8807 3.8940 3.8770 3.9247 1.0330 1.0296 0.9928 1.0053 1.0039 1.0029 1.0019 0.9999 1.0195 0.9920 1.0167 1.0084 0.9899 1.0037 1.0083 1.0285 0.9890 0.9954 0.9906
dispcorr: -0.035569292 hartree
energy: -11427.178199260950
dipole: -83.37346 83.90816 0.53470 -17.77786 16.27679 -1.50106 -73.56673 75.44301 1.87628
magnitude: 2.46161 au
magnitude: 6.25691 debye
